BDBM120933 US8716296, 1
SMILES COc1ccccc1-c1cc(ncn1)N(C)C(=O)[C@@H]1CCCNC1
InChI Key InChIKey=LLVLXDYXPDNWEX-CYBMUJFWSA-N
Data  1 IC50
  Tab Delimited (TSV)   2D SDfile   Computed 3D by Vconf -m prep SDfile
Find this compound or compounds like it in BindingDB:
Activity Spreadsheet -- Enzyme Inhibition Constant Data from BindingDB
Found 1 hit for monomerid = 120933
TargetCyclin-dependent kinase 9(Homo sapiens (Human))
Ingenium Pharmaceuticals
US Patent
LigandPNGBDBM120933(US8716296, 1)
Affinity DataIC50:  10nMpH: 7.5Assay Description:All kinase assays were performed in 96-well FlashPlates from Perkin Elmer/NEN (Boston, Mass., USA) in a 50 μl reaction volume. The reaction mixt...
In DepthDetails US Patent