BDBM12168 2-{[(3S,5S)-5-(pyrrolidin-1-ylcarbonyl)pyrrolidin-3-yl]carbonyl}-5-(trifluoromethyl)-2,3-dihydro-1H-isoindole::pyrrolidine-2,4-dicarboxylic acid amide 8d
SMILES FC(F)(F)c1ccc2CN(Cc2c1)C(=O)[C@@H]1CN[C@@H](C1)C(=O)N1CCCC1
InChI Key InChIKey=ZXYMQVABWZXTNI-BBRMVZONSA-N
Data  4 IC50
  Tab Delimited (TSV)   2D SDfile   Computed 3D by Vconf -m prep SDfile
Find this compound or compounds like it in BindingDB:
Activity Spreadsheet -- Enzyme Inhibition Constant Data from BindingDB
Found 4 hits for monomerid = 12168
TargetDipeptidyl peptidase 4(Homo sapiens (Human))
National Health Research Institutes
LigandPNGBDBM12168(2-{[(3S,5S)-5-(pyrrolidin-1-ylcarbonyl)pyrrolidin-...)
Affinity DataIC50:  73nMpH: 8.0 T: 2°C. Assay description: The enzyme activity resulted in the liberation of free pNA at 405 nm. Reaction progress was monitored using a Molecular Devices SpectraMax Plus micro...
In DepthDetails ArticlePubMed
TargetProlyl endopeptidase FAP(Homo sapiens (Human))
National Health Research Institutes
LigandPNGBDBM12168(2-{[(3S,5S)-5-(pyrrolidin-1-ylcarbonyl)pyrrolidin-...)
Affinity DataIC50: >2.00E+4nM. Assay description: The enzyme activity resulted in the liberation of free pNA at 405 nm. Reaction progress was monitored using a Molecular Devices SpectraMax Plus micro...
In DepthDetails ArticlePubMed
TargetDipeptidyl peptidase 2(Homo sapiens (Human))
National Health Research Institutes
LigandPNGBDBM12168(2-{[(3S,5S)-5-(pyrrolidin-1-ylcarbonyl)pyrrolidin-...)
Affinity DataIC50: >2.00E+4nM. Assay description: The enzyme activity resulted in the liberation of free pNA at 405 nm. Reaction progress was monitored using a Molecular Devices SpectraMax Plus micro...
In DepthDetails ArticlePubMed
TargetDipeptidyl peptidase 8(Homo sapiens (Human))
National Health Research Institutes
LigandPNGBDBM12168(2-{[(3S,5S)-5-(pyrrolidin-1-ylcarbonyl)pyrrolidin-...)
Affinity DataIC50: >2.00E+4nM. Assay description: The enzyme activity resulted in the liberation of free pNA at 405 nm. Reaction progress was monitored using a Molecular Devices SpectraMax Plus micro...
In DepthDetails ArticlePubMed