BDBM12177 2-{[(3S,5S)-5-[(3,3-difluoropyrrolidin-1-yl)carbonyl]pyrrolidin-3-yl]carbonyl}-2,3-dihydro-1H-isoindole::pyrrolidine-2,4-dicarboxylic acid amide 8m
SMILES FC1(F)CCN(C1)C(=O)[C@@H]1C[C@@H](CN1)C(=O)N1Cc2ccccc2C1
InChI Key InChIKey=VJUQFPMKSWQOBY-GJZGRUSLSA-N
Data  4 IC50
  Tab Delimited (TSV)   2D SDfile   Computed 3D by Vconf -m prep SDfile
Find this compound or compounds like it in BindingDB:
Activity Spreadsheet -- Enzyme Inhibition Constant Data from BindingDB
Found 4 hits for monomerid = 12177
TargetDipeptidyl peptidase 4(Homo sapiens (Human))
National Health Research Institutes
LigandPNGBDBM12177(2-{[(3S,5S)-5-[(3,3-difluoropyrrolidin-1-yl)carbon...)
Affinity DataIC50:  129nMpH: 8.0 T: 2°C. Assay description: The enzyme activity resulted in the liberation of free pNA at 405 nm. Reaction progress was monitored using a Molecular Devices SpectraMax Plus micro...
In DepthDetails ArticlePubMed
TargetProlyl endopeptidase FAP(Homo sapiens (Human))
National Health Research Institutes
LigandPNGBDBM12177(2-{[(3S,5S)-5-[(3,3-difluoropyrrolidin-1-yl)carbon...)
Affinity DataIC50:  1.95E+4nM. Assay description: The enzyme activity resulted in the liberation of free pNA at 405 nm. Reaction progress was monitored using a Molecular Devices SpectraMax Plus micro...
In DepthDetails ArticlePubMed
TargetDipeptidyl peptidase 2(Homo sapiens (Human))
National Health Research Institutes
LigandPNGBDBM12177(2-{[(3S,5S)-5-[(3,3-difluoropyrrolidin-1-yl)carbon...)
Affinity DataIC50:  1.93E+4nM. Assay description: The enzyme activity resulted in the liberation of free pNA at 405 nm. Reaction progress was monitored using a Molecular Devices SpectraMax Plus micro...
In DepthDetails ArticlePubMed
TargetDipeptidyl peptidase 8(Homo sapiens (Human))
National Health Research Institutes
LigandPNGBDBM12177(2-{[(3S,5S)-5-[(3,3-difluoropyrrolidin-1-yl)carbon...)
Affinity DataIC50: >2.00E+4nM. Assay description: The enzyme activity resulted in the liberation of free pNA at 405 nm. Reaction progress was monitored using a Molecular Devices SpectraMax Plus micro...
In DepthDetails ArticlePubMed