BDBM121790 US8722692, 229
SMILES CC(C)Nc1nc(cc2ncn(C)c(=O)c12)-c1ccc(CCN2CCOCC2)cc1
InChI Key InChIKey=YDBCQMZZCYXRJA-UHFFFAOYSA-N
Data  1 IC50
  Tab Delimited (TSV)   2D SDfile   Computed 3D by Vconf -m prep SDfile
Find this compound or compounds like it in BindingDB:
Activity Spreadsheet -- Enzyme Inhibition Constant Data from BindingDB
Found 1 hit for monomerid = 121790
TargetTyrosine-protein kinase SYK(Homo sapiens (Human))
TBA
US Patent
LigandPNGBDBM121790(US8722692, 229)
Affinity DataIC50:  380nM. Assay description: Compounds of the examples provided herein were assessed for their ability to inhibit Syk kinase by utilizing Caliper Life Sciences' proprietary L...
In DepthDetails US Patent