BDBM121791 US8722692, 230
SMILES Cn1cnc2cc(nc(NC3CC3)c2c1=O)-c1ccc(CCN2CCCCC2)cc1
InChI Key InChIKey=FTZQVHFZRKVQLJ-UHFFFAOYSA-N
Data  1 IC50
  Tab Delimited (TSV)   2D SDfile   Computed 3D by Vconf -m prep SDfile
Find this compound or compounds like it in BindingDB:
Activity Spreadsheet -- Enzyme Inhibition Constant Data from BindingDB
Found 1 hit for monomerid = 121791
TargetTyrosine-protein kinase SYK(Homo sapiens (Human))
TBA
US Patent
LigandPNGBDBM121791(US8722692, 230)
Affinity DataIC50:  141nM. Assay description: Compounds of the examples provided herein were assessed for their ability to inhibit Syk kinase by utilizing Caliper Life Sciences' proprietary L...
In DepthDetails US Patent