BDBM121975 US8722692, 414
SMILES Cn1cnc2cc(nc(NCCC#N)c2c1=O)-c1ccc(cc1)N1CCOCC1
InChI Key InChIKey=TXTLGHSLMWSUEO-UHFFFAOYSA-N
Data  1 IC50
  Tab Delimited (TSV)   2D SDfile   Computed 3D by Vconf -m prep SDfile
Find this compound or compounds like it in BindingDB:
Activity Spreadsheet -- Enzyme Inhibition Constant Data from BindingDB
Found 1 hit for monomerid = 121975
TargetTyrosine-protein kinase SYK(Homo sapiens (Human))
TBA
US Patent
LigandPNGBDBM121975(US8722692, 414)
Affinity DataIC50:  133nM. Assay description: Compounds of the examples provided herein were assessed for their ability to inhibit Syk kinase by utilizing Caliper Life Sciences' proprietary L...
In DepthDetails US Patent