BDBM122443 US8729078, I-54
SMILES CC(C)(C)c1ccc2c(cnn(-c3cccc(c3CO)-n3cc(C(N)=O)c(Nc4ccccn4)n3)c2=O)c1
InChI Key InChIKey=XQBUJYAUKBBWPS-UHFFFAOYSA-N
Data  1 IC50
  Tab Delimited (TSV)   2D SDfile   Computed 3D by Vconf -m prep SDfile
Find this compound or compounds like it in BindingDB:
Activity Spreadsheet -- Enzyme Inhibition Constant Data from BindingDB
Found 1 hit for monomerid = 122443
TargetTyrosine-protein kinase BTK(Homo sapiens (Human))
Hoffmann-La Roche
US Patent
LigandPNGBDBM122443(US8729078, I-54)
Affinity DataIC50:  0.950nMpH: 7.2Assay Description:Plates assayed are 96-well polypropylene (Greiner) and 96-well 1.2 μm hydrophilic PVDF filter plates (Millipore). Concentrations reported here a...
In DepthDetails US Patent