BDBM122444 US8729078, I-55
SMILES CN(C)Cc1ccc(Nc2nn(cc2C(N)=O)-c2cccc(c2CO)-n2ncc3cc(ccc3c2=O)C(C)(C)C)nc1
InChI Key InChIKey=JIYLEJLIWCOHDI-UHFFFAOYSA-N
Data  1 IC50
  Tab Delimited (TSV)   2D SDfile   Computed 3D by Vconf -m prep SDfile
Find this compound or compounds like it in BindingDB:
Activity Spreadsheet -- Enzyme Inhibition Constant Data from BindingDB
Found 1 hit for monomerid = 122444
TargetTyrosine-protein kinase BTK(Homo sapiens (Human))
Hoffmann-La Roche
US Patent
LigandPNGBDBM122444(US8729078, I-55)
Affinity DataIC50:  0.390nMpH: 7.2Assay Description:Plates assayed are 96-well polypropylene (Greiner) and 96-well 1.2 μm hydrophilic PVDF filter plates (Millipore). Concentrations reported here a...
In DepthDetails US Patent