BDBM12307 (1R,5S)-N-[3-amino-1-(cyclobutylmethyl)-2,3-dioxopropyl]-6,6-dimethyl-3-[2(S)-[[[(1-methylethyl)amino]carbonyl]amino]-3,3-dimethyl-1-oxobutyl]-3-azabicyclo[3.1.0]hexan-2(S)-carboxamide::4-cyclobutyl-3-{[(1R,2S,5S)-3-[(2S)-3,3-dimethyl-2-[(propan-2-ylcarbamoyl)amino]butanoyl]-6,6-dimethyl-3-azabicyclo[3.1.0]hexan-2-yl]formamido}-2-oxobutanamide::SCH 503034 Analogue 66
SMILES CC(C)NC(=O)N[C@H](C(=O)N1C[C@H]2[C@@H]([C@H]1C(=O)NC(CC1CCC1)C(=O)C(N)=O)C2(C)C)C(C)(C)C
InChI Key InChIKey=GBEBMXGNSZYQLY-DOVBMPENSA-N
Data  1 KI
  Tab Delimited (TSV)   2D SDfile   Computed 3D by Vconf -m prep SDfile
Find this compound or compounds like it in BindingDB:
Activity Spreadsheet -- Enzyme Inhibition Constant Data from BindingDB
Found 1 hit for monomerid = 12307
TargetGenome polyprotein(Hepatitis C virus (HCV genotype 1a, isolate H))
Schering-Plough Research Institute
LigandPNGBDBM12307((1R,5S)-N-[3-amino-1-(cyclobutylmethyl)-2,3-dioxop...)
Affinity DataKi:  16nM. Assay description: Proteolytic cleavage of the ester linkage between the Nva (L-norvaline) and the chromophore (PAP) was monitored for change in absorbance at 370 nm. I...
In DepthDetails ArticlePubMed