BDBM123418 US8741944, 39
SMILES NS(=O)(=O)c1ccc(cc1)-n1nc(cc1-c1ccc(CCN=[N+]=[N-])cc1)C(F)(F)F
InChI Key InChIKey=DZZQBBYGNCJQAK-UHFFFAOYSA-N
Data  1 IC50
  Tab Delimited (TSV)   2D SDfile   Computed 3D by Vconf -m prep SDfile
Find this compound or compounds like it in BindingDB:
Activity Spreadsheet -- Enzyme Inhibition Constant Data from BindingDB
Found 1 hit for monomerid = 123418
Target3-phosphoinositide-dependent protein kinase 1(Homo sapiens (Human))
The Ohio State University Research Foundation
US Patent
LigandPNGBDBM123418(US8741944, 39)
Affinity DataIC50:  3.20E+4nM. Assay description: PDK-1 kinase activity This in vitro assay was performed using a PDK-1 kinase assay kit (Upstate, Lake Placid, N.Y.) according to the vendor's ins...
In DepthDetails US Patent