BDBM1236 (Hydroxyethyl)amidosuccinoyl deriv. 8::benzyl N-[(1S)-1-{[(2S,3S)-4-[(2R)-N,2-di-tert-butylbutanediamido]-3-hydroxy-1-phenylbutan-2-yl]carbamoyl}-2-methylpropyl]carbamate
SMILES CC(C)[C@H](NC(=O)OCc1ccccc1)C(=O)N[C@@H](Cc1ccccc1)[C@@H](O)CNC(=O)[C@H](CC(=O)NC(C)(C)C)C(C)(C)C
InChI Key InChIKey=UPWOUZDRKCEYPI-NUISNXNRSA-N
Data  1 IC50
  Tab Delimited (TSV)   2D SDfile   Computed 3D by Vconf -m prep SDfile
Find this compound or compounds like it in BindingDB:
Activity Spreadsheet -- Enzyme Inhibition Constant Data from BindingDB
Found 1 hit for monomerid = 1236
TargetDimer of Gag-Pol polyprotein [489-587](Human immunodeficiency virus type 1)
Boehringer Ingelheim (Canada)
LigandPNGBDBM1236((Hydroxyethyl)amidosuccinoyl deriv. 8 | benzyl N-[...)
Affinity DataIC50:  50nMpH: 5.5 T: 2°C. Assay description: Sensitivity of HIV-1 protease activity to protease inhibitors was determined by a peptide substrate cleavage assay. Cleavage products and substrate w...
In DepthDetails ArticlePubMed