BDBM123693 US8741915, 1
SMILES CCOc1cc(cc(c1O)N(=O)=O)C1NC(=O)N=C(C1c1ccccc1)c1ccccc1
InChI Key InChIKey=QOVFYKJDUHRDDL-UHFFFAOYSA-N
Data  1 IC50
  Tab Delimited (TSV)   2D SDfile   Computed 3D by Vconf -m prep SDfile
Find this compound or compounds like it in BindingDB:
Activity Spreadsheet -- Enzyme Inhibition Constant Data from BindingDB
Found 1 hit for monomerid = 123693
TargetAlcohol dehydrogenase class-3(Homo sapiens (Human))
N30 Pharmaceuticals
US Patent
LigandPNGBDBM123693(US8741915, 1)
Affinity DataIC50:  29nMpH: 7.4 T: 2°C. Assay description: GSNO and Enzyme/NADH Solutions are made up fresh each day. The Solutions are filtered and allowed to warm to room temperature. GSNO Solution: 100 mM ...
In DepthDetails US Patent