BDBM123708 US8741915, 159
SMILES Cn1ccc(n1)C1=NC(=O)NC(C1c1ccsc1)c1ccc(C(O)=O)c(O)c1
InChI Key InChIKey=ODEXPODBENTCPE-UHFFFAOYSA-N
Data  1 IC50
  Tab Delimited (TSV)   2D SDfile   Computed 3D by Vconf -m prep SDfile
Find this compound or compounds like it in BindingDB:
Activity Spreadsheet -- Enzyme Inhibition Constant Data from BindingDB
Found 1 hit for monomerid = 123708
TargetAlcohol dehydrogenase class-3(Homo sapiens (Human))
N30 Pharmaceuticals
US Patent
LigandPNGBDBM123708(US8741915, 159)
Affinity DataIC50:  39nMpH: 7.4 T: 2°C. Assay description: GSNO and Enzyme/NADH Solutions are made up fresh each day. The Solutions are filtered and allowed to warm to room temperature. GSNO Solution: 100 mM ...
In DepthDetails US Patent