BDBM123712 US8741915, 6
SMILES CCOc1cc(cc(c1O)[N+]([O-])=O)[C@@H]1NC(=O)N=C(C1c1ccsc1)c1ccccc1
InChI Key InChIKey=AKDQCRSWAYXLAK-IJHRGXPZSA-N
Data  1 IC50
  Tab Delimited (TSV)   2D SDfile   Computed 3D by Vconf -m prep SDfile
Find this compound or compounds like it in BindingDB:
Activity Spreadsheet -- Enzyme Inhibition Constant Data from BindingDB
Found 1 hit for monomerid = 123712
TargetAlcohol dehydrogenase class-3(Homo sapiens (Human))
N30 Pharmaceuticals
US Patent
LigandPNGBDBM123712(US8741915, 6)
Affinity DataIC50:  18nMpH: 7.4 T: 2°C. Assay description: GSNO and Enzyme/NADH Solutions are made up fresh each day. The Solutions are filtered and allowed to warm to room temperature. GSNO Solution: 100 mM ...
In DepthDetails US Patent