BDBM123765 N-(4-Cyanophenyl)-2-((2-(6,7-dimethoxy- 3,4-dihydroisoquinolin-2(1H)-yl)ethyl)amino) acetamide (34d)
SMILES COc1cc2CCN(CCNCC(=O)Nc3ccc(cc3)C#N)Cc2cc1OC
InChI Key InChIKey=DZTJPOQXVAOCTL-UHFFFAOYSA-N
Data  1 IC50
  Tab Delimited (TSV)   2D SDfile   Computed 3D by Vconf -m prep SDfile
Find this compound or compounds like it in BindingDB:
Activity Spreadsheet -- Enzyme Inhibition Constant Data from BindingDB
Found 1 hit for monomerid = 123765
TargetDipeptidyl peptidase 4(Homo sapiens (Human))
China Pharmaceutical University
LigandPNGBDBM123765(N-(4-Cyanophenyl)-2-((2-(6,7-dimethoxy- 3,4-dihydr...)
Affinity DataIC50:  494nMpH: 7.5Assay Description:The reaction contained 10 uM of Ala-Pro-AMC, 50 pM of enzyme DDP-4, different concentrations of test compounds, and assay buffer (100 mM HEPES, pH 7....
In DepthDetails ArticlePubMed