BDBM123773 N-(2,4-Dichlorophenyl)-2-((2-(6,7- dimethoxy-3,4-dihydroisoquinolin-2(1H)-yl)- 2-oxoethyl)amino)acetamide (35e)
SMILES COc1cc2CCN(Cc2cc1OC)C(=O)CNCC(=O)Nc1ccc(Cl)cc1Cl
InChI Key InChIKey=YDMFCVZVSBKFLL-UHFFFAOYSA-N
Data  1 IC50
  Tab Delimited (TSV)   2D SDfile   Computed 3D by Vconf -m prep SDfile
Find this compound or compounds like it in BindingDB:
Activity Spreadsheet -- Enzyme Inhibition Constant Data from BindingDB
Found 1 hit for monomerid = 123773
TargetDipeptidyl peptidase 4(Homo sapiens (Human))
China Pharmaceutical University
LigandPNGBDBM123773(N-(2,4-Dichlorophenyl)-2-((2-(6,7- dimethoxy-3,4-d...)
Affinity DataIC50:  92nMpH: 7.5Assay Description:The reaction contained 10 uM of Ala-Pro-AMC, 50 pM of enzyme DDP-4, different concentrations of test compounds, and assay buffer (100 mM HEPES, pH 7....
In DepthDetails ArticlePubMed