BDBM124227 Methyl 2,3,4-tri-O-benzyl-6-O-[1-(4-carboxyphenyl)-1H- 1,2,3-triazol-4-ylmethyl] a-D-glucopyranoside (14)
SMILES CO[C@H]1O[C@H](COCc2cn(nn2)-c2ccc(cc2)C(O)=O)[C@@H](OCc2ccccc2)[C@H](OCc2ccccc2)[C@H]1OCc1ccccc1
InChI Key InChIKey=ILFJIDBLJWVYCF-DJCHGSEYSA-N
Data  1 IC50
  Tab Delimited (TSV)   2D SDfile   Computed 3D by Vconf -m prep SDfile
Find this compound or compounds like it in BindingDB:
Activity Spreadsheet -- Enzyme Inhibition Constant Data from BindingDB
Found 1 hit for monomerid = 124227
TargetTyrosine-protein phosphatase non-receptor type 1(Homo sapiens (Human))
East China University Of Science And Technology
LigandPNGBDBM124227(Methyl 2,3,4-tri-O-benzyl-6-O-[1-(4-carboxyphenyl)...)
Affinity DataIC50: >1.00E+5nMT: 2°C. Assay description: The assay mixture (100 ??L) containing 50 mM MOPS (pH 6.5), 2 mM pNPP and PTP1B were monitored at 405 nm for 2 min at 30 ??C.
In DepthDetails ArticlePubMed