BDBM124797 US8765940, 1-(5,7-difluoro-3-methyl-4-(6'-(4-morpholinyl)-2,3,5,6-tetrahydrospiro[pyran-4,3'-pyrrolo[3,2-b]pyridin]-1'(2H)-yl)-2-quinolinyl)-2-azetidinone
SMILES Cc1c(nc2cc(F)cc(F)c2c1N1CC2(CCOCC2)c2ncc(cc12)N1CCOCC1)N1CCC1=O
InChI Key InChIKey=RCGOGBCYAJWBSU-UHFFFAOYSA-N
Data  1 KI
  Tab Delimited (TSV)   2D SDfile   Computed 3D by Vconf -m prep SDfile
Find this compound or compounds like it in BindingDB:
Activity Spreadsheet -- Enzyme Inhibition Constant Data from BindingDB
Found 1 hit for monomerid = 124797
LigandPNGBDBM124797(US8765940, 1-(5,7-difluoro-3-methyl-4-(6'-(4-morph...)
Affinity DataKi:  1.27nMpH: 7.0Assay Description:A PI3K Alphascreen assay (PerkinElmer, Waltham, Mass.) was used to measure the activity of a panel of four phosphoinositide 3-kinases: PI3Kα, PI...
In DepthDetails US Patent