BDBM1262 L-682, 679 analog 21::tert-butyl N-[(2S,3S,5R)-5-benzyl-5-{[(1S)-1-carbamoyl-2-hydroxyethyl]carbamoyl}-3-hydroxy-1-phenylpentan-2-yl]carbamate
SMILES CC(C)(C)OC(=O)N[C@@H](Cc1ccccc1)[C@@H](O)C[C@@H](Cc1ccccc1)C(=O)N[C@@H](CO)C(N)=O
InChI Key InChIKey=JPGLOJKGALKWIG-LDVJMBRRSA-N
Data  1 IC50
  Tab Delimited (TSV)   2D SDfile   Computed 3D by Vconf -m prep SDfile
Find this compound or compounds like it in BindingDB:
Activity Spreadsheet -- Enzyme Inhibition Constant Data from BindingDB
Found 1 hit for monomerid = 1262
TargetDimer of Gag-Pol polyprotein [489-587](Human immunodeficiency virus type 1)
Merck Sharp And Dohme Research Laboratories
LigandPNGBDBM1262(L-682, 679 analog 21 | tert-butyl N-[(2S,3S,5R)-5-...)
Affinity DataIC50:  606nMpH: 5.5 T: 2°C. Assay description: Sensitivity of HIV-1 protease activity to protease inhibitors was determined by a peptide substrate cleavage assay. Protease products were analyzed o...
In DepthDetails ArticlePubMed