BDBM12623 2,4-Diamino-5-ketopyrimidine 41::2-N-(1-methanesulfonylpiperidin-4-yl)-5-[(2,3,4-trifluoro-6-methoxyphenyl)carbonyl]pyrimidine-2,4-diamine::[4-Amino-2-(1-methanesulfonylpiperidin-4-ylamino)pyrimidin-5-yl](2,3,4-trifluoro-6-methoxyphenyl)methanone
SMILES COc1cc(F)c(F)c(F)c1C(=O)c1cnc(NC2CCN(CC2)S(C)(=O)=O)nc1N
InChI Key InChIKey=AAOLDQJTTACKSD-UHFFFAOYSA-N
Data  3 KI
  Tab Delimited (TSV)   2D SDfile   Computed 3D by Vconf -m prep SDfile
Find this compound or compounds like it in BindingDB:
Activity Spreadsheet -- Enzyme Inhibition Constant Data from BindingDB
Found 3 hits for monomerid = 12623
TargetCyclin-dependent kinase 4/G1/S-specific cyclin-D1(Homo sapiens (Human))
Hoffmann-La Roche
LigandPNGBDBM12623(2,4-Diamino-5-ketopyrimidine 41 | 2-N-(1-methanesu...)
Affinity DataKi:  1nM. Assay description: Enzymes were assayed with retinoblastoma substrate in 384-well plates containing diluted test compounds. Final ATP concentration was 3x the respectiv...
In DepthDetails ArticlePubMed
TargetCyclin-dependent kinase 2/G1/S-specific cyclin-E1(Homo sapiens (Human))
Hoffmann-La Roche
LigandPNGBDBM12623(2,4-Diamino-5-ketopyrimidine 41 | 2-N-(1-methanesu...)
Affinity DataKi:  2nM. Assay description: Enzymes were assayed with retinoblastoma substrate in 384-well plates containing diluted test compounds. Final ATP concentration was 3x the respectiv...
In DepthDetails ArticlePubMed
TargetCyclin-dependent kinase/G2/mitotic-specific cyclin- 1(Homo sapiens (Human))
Hoffmann-La Roche
LigandPNGBDBM12623(2,4-Diamino-5-ketopyrimidine 41 | 2-N-(1-methanesu...)
Affinity DataKi:  5nM. Assay description: Enzymes were assayed with retinoblastoma substrate in 384-well plates containing diluted test compounds. Final ATP concentration was 3x the respectiv...
In DepthDetails ArticlePubMed