BDBM1272 L-682, 679 analog 31::tert-butyl N-[(2S,3S,5R)-5-benzyl-3-hydroxy-5-{[(1S)-1-[(1-hydroxy-3-phenylpropan-2-yl)carbamoyl]-3-methylbutyl]carbamoyl}-1-phenylpentan-2-yl]carbamate
SMILES CC(C)C[C@H](NC(=O)[C@@H](C[C@H](O)[C@H](Cc1ccccc1)NC(=O)OC(C)(C)C)Cc1ccccc1)C(=O)NC(CO)Cc1ccccc1
InChI Key InChIKey=SQROEJGKHXDYDS-KNQUDQSESA-N
Data  1 IC50
  Tab Delimited (TSV)   2D SDfile   Computed 3D by Vconf -m prep SDfile
Find this compound or compounds like it in BindingDB:
Activity Spreadsheet -- Enzyme Inhibition Constant Data from BindingDB
Found 1 hit for monomerid = 1272
TargetDimer of Gag-Pol polyprotein [489-587](Human immunodeficiency virus type 1)
Merck Sharp And Dohme Research Laboratories
LigandPNGBDBM1272(L-682, 679 analog 31 | tert-butyl N-[(2S,3S,5R)-5-...)
Affinity DataIC50:  1.5nMpH: 5.5 T: 2°C. Assay description: Sensitivity of HIV-1 protease activity to protease inhibitors was determined by a peptide substrate cleavage assay. Protease products were analyzed o...
In DepthDetails ArticlePubMed