BDBM127821 US10251889, Example 195::US10758542, Example 194::US8791123, 194::US9782415, Example 194::US9796724, Example 194
SMILES Cc1ncc(F)cc1C1CCCN1c1ccn2ncc(C(=O)NC3CC[C@H](O)CC3)c2n1
InChI Key InChIKey=FDBFUEIJFKHRQU-HPRBVPRMSA-N
Data  40 IC50
  Tab Delimited (TSV)   2D SDfile   Computed 3D by Vconf -m prep SDfile
Find this compound or compounds like it in BindingDB:
Activity Spreadsheet -- Enzyme Inhibition Constant Data from BindingDB
Found 40 hits for monomerid = 127821
TargetHigh affinity nerve growth factor receptor(Homo sapiens (Human))
Array Biopharma
US Patent
LigandPNGBDBM127821(US10251889, Example 195 | US10758542, Example 194 ...)
Affinity DataIC50:  4.70nMpH: 7.5Assay Description:An enzyme-linked immunosorbant assay (ELISA) was used to assess TrkA kinase activity in the presence of inhibitors. Immulon 4HBX 384-well microtiter ...
In DepthDetails US Patent
TargetNon-receptor tyrosine-protein kinase TYK2(Homo sapiens (Human))
Array Biopharma
US Patent
LigandPNGBDBM127821(US10251889, Example 195 | US10758542, Example 194 ...)
Affinity DataIC50: >1.00E+3nM. Assay description: Tyk2: Compounds of Formula I were screened for their ability to inhibit Tyk2 using the general enzyme inhibition assay method, in which the assay mix...
In DepthDetails US Patent
TargetTyrosine-protein kinase JAK1(Homo sapiens (Human))
Array Biopharma
US Patent
LigandPNGBDBM127821(US10251889, Example 195 | US10758542, Example 194 ...)
Affinity DataIC50: >1.00E+3nM. Assay description: Compounds of Formula I were screened for their ability to inhibit Jak1 using the general enzyme inhibition assay method, in which the assay mixture c...
In DepthDetails US Patent
TargetTyrosine-protein kinase JAK3(Homo sapiens (Human))
Array Biopharma
US Patent
LigandPNGBDBM127821(US10251889, Example 195 | US10758542, Example 194 ...)
Affinity DataIC50: >1.00E+3nM. Assay description: Compounds of Formula I were screened for their ability to inhibit Jak3 using the general enzyme inhibition assay method, in which the assay mixture c...
In DepthDetails US Patent
TargetNon-receptor tyrosine-protein kinase TYK2(Homo sapiens (Human))
Array Biopharma
US Patent
LigandPNGBDBM127821(US10251889, Example 195 | US10758542, Example 194 ...)
Affinity DataIC50: >1.00E+3nM. Assay description: Compounds of Formula I were screened for their ability to inhibit Tyk2 using the general enzyme inhibition assay method, in which the assay mixture c...
In DepthDetails US Patent
TargetHigh affinity nerve growth factor receptor(Homo sapiens (Human))
Array Biopharma
US Patent
LigandPNGBDBM127821(US10251889, Example 195 | US10758542, Example 194 ...)
Affinity DataIC50:  4.70nM. Assay description: An enzyme-linked immunosorbant assay (ELISA) was used to assess TrkA kinase activity in the presence of inhibitors. Immulon 4HBX 384-well microtiter ...
In DepthDetails US Patent
TargetTyrosine-protein kinase JAK2(Homo sapiens (Human))
Array Biopharma
US Patent
LigandPNGBDBM127821(US10251889, Example 195 | US10758542, Example 194 ...)
Affinity DataIC50: >1.00E+3nM. Assay description: Compounds of Formula I were screened for their ability to inhibit Jak2 using the general enzyme inhibition assay method, in which the assay mixture c...
In DepthDetails US Patent
TargetHigh affinity nerve growth factor receptor(Homo sapiens (Human))
Array Biopharma
US Patent
LigandPNGBDBM127821(US10251889, Example 195 | US10758542, Example 194 ...)
Affinity DataIC50:  7.70nM. Assay description: An enzyme-linked immunosorbant assay (ELISA) was used to assess TrkA kinase activity in the presence of inhibitors. Immulon 4HBX 384-well microtiter ...
In DepthDetails US Patent
TargetTyrosine-protein kinase JAK2(Homo sapiens (Human))
Array Biopharma
US Patent
LigandPNGBDBM127821(US10251889, Example 195 | US10758542, Example 194 ...)
Affinity DataIC50: >1.00E+3nM. Assay description: Compounds of Formula I were screened for their ability to inhibit Jak2 using the general enzyme inhibition assay method, in which the assay mixture c...
In DepthDetails US Patent
TargetHigh affinity nerve growth factor receptor(Homo sapiens (Human))
Array Biopharma
US Patent
LigandPNGBDBM127821(US10251889, Example 195 | US10758542, Example 194 ...)
Affinity DataIC50:  4.60nM. Assay description: An enzyme-linked immunosorbant assay (ELISA) was used to assess TrkA kinase activity in the presence of inhibitors. Immulon 4HBX 384-well microtiter ...
In DepthDetails US Patent
TargetTyrosine-protein kinase JAK1(Homo sapiens (Human))
Array Biopharma
US Patent
LigandPNGBDBM127821(US10251889, Example 195 | US10758542, Example 194 ...)
Affinity DataIC50: >1.00E+3nM. Assay description: Compounds of Formula I were screened for their ability to inhibit Jak1 using the general enzyme inhibition assay method, in which the assay mixture c...
In DepthDetails US Patent
TargetTyrosine-protein kinase JAK2(Homo sapiens (Human))
Array Biopharma
US Patent
LigandPNGBDBM127821(US10251889, Example 195 | US10758542, Example 194 ...)
Affinity DataIC50: >1.00E+3nM. Assay description: Compounds of Formula I were screened for their ability to inhibit Jak2 using the general enzyme inhibition assay method, in which the assay mixture c...
In DepthDetails US Patent
TargetTyrosine-protein kinase JAK3(Homo sapiens (Human))
Array Biopharma
US Patent
LigandPNGBDBM127821(US10251889, Example 195 | US10758542, Example 194 ...)
Affinity DataIC50: >1.00E+3nM. Assay description: Compounds of Formula I were screened for their ability to inhibit Jak3 using the general enzyme inhibition assay method, in which the assay mixture c...
In DepthDetails US Patent
TargetNon-receptor tyrosine-protein kinase TYK2 [886-1187](Homo sapiens (Human))
Array Biopharma
US Patent
LigandPNGBDBM127821(US10251889, Example 195 | US10758542, Example 194 ...)
Affinity DataIC50: >1.00E+3nM. Assay description: Compounds of Formula I were screened for their ability to inhibit Tyk2 using the general enzyme inhibition assay method, in which the assay mixture c...
In DepthDetails US Patent
TargetTyrosine-protein kinase JAK2(Homo sapiens (Human))
Array Biopharma
US Patent
LigandPNGBDBM127821(US10251889, Example 195 | US10758542, Example 194 ...)
Affinity DataIC50:  4.70nM. Assay description: Compounds of Formula I were screened for their ability to inhibit Jak2 using the general enzyme inhibition assay method, in which the assay mixture c...
In DepthDetails US Patent
TargetHigh affinity nerve growth factor receptor(Homo sapiens (Human))
Array Biopharma
US Patent
LigandPNGBDBM127821(US10251889, Example 195 | US10758542, Example 194 ...)
Affinity DataIC50: >1.00E+3nM. Assay description: An enzyme-linked immunosorbant assay (ELISA) was used to assess TrkA kinase activity in the presence of inhibitors. Immulon 4HBX 384-well microtiter ...
In DepthDetails US Patent
TargetTyrosine-protein kinase JAK2(Homo sapiens (Human))
Array Biopharma
US Patent
LigandPNGBDBM127821(US10251889, Example 195 | US10758542, Example 194 ...)
Affinity DataIC50:  7.70nM. Assay description: Compounds of Formula I were screened for their ability to inhibit Jak2 using the general enzyme inhibition assay method, in which the assay mixture c...
In DepthDetails US Patent
TargetHigh affinity nerve growth factor receptor(Homo sapiens (Human))
Array Biopharma
US Patent
LigandPNGBDBM127821(US10251889, Example 195 | US10758542, Example 194 ...)
Affinity DataIC50: >1.00E+3nM. Assay description: An enzyme-linked immunosorbant assay (ELISA) was used to assess TrkA kinase activity in the presence of inhibitors. Immulon 4HBX 384-well microtiter ...
In DepthDetails US Patent
TargetHigh affinity nerve growth factor receptor(Homo sapiens (Human))
Array Biopharma
US Patent
LigandPNGBDBM127821(US10251889, Example 195 | US10758542, Example 194 ...)
Affinity DataIC50:  4.60nM. Assay description: Trk enzymatic selectivity was assessed using Omnia™ Kinase Assay reagents from Invitrogen Corp. Enzyme (either TrkA or TrkB from Invitrogen Corp.) an...
In DepthDetails US Patent
TargetTyrosine-protein kinase JAK1(Homo sapiens (Human))
Array Biopharma
US Patent
LigandPNGBDBM127821(US10251889, Example 195 | US10758542, Example 194 ...)
Affinity DataIC50: >1.00E+3nM. Assay description: Compounds of Formula I were screened for their ability to inhibit Jak1 using the general enzyme inhibition assay method, in which the assay mixture c...
In DepthDetails US Patent
TargetTyrosine-protein kinase JAK2(Homo sapiens (Human))
Array Biopharma
US Patent
LigandPNGBDBM127821(US10251889, Example 195 | US10758542, Example 194 ...)
Affinity DataIC50: >1.00E+3nM
In DepthDetails US Patent
TargetTyrosine-protein kinase JAK3(Homo sapiens (Human))
Array Biopharma
US Patent
LigandPNGBDBM127821(US10251889, Example 195 | US10758542, Example 194 ...)
Affinity DataIC50: >1.00E+3nM. Assay description: Compounds of Formula I were screened for their ability to inhibit Jak3 using the general enzyme inhibition assay method, in which the assay mixture c...
In DepthDetails US Patent
TargetNon-receptor tyrosine-protein kinase TYK2(Homo sapiens (Human))
Array Biopharma
US Patent
LigandPNGBDBM127821(US10251889, Example 195 | US10758542, Example 194 ...)
Affinity DataIC50: >1.00E+3nM. Assay description: Compounds of Formula I were screened for their ability to inhibit Tyk2 using the general enzyme inhibition assay method, in which the assay mixture c...
In DepthDetails US Patent
TargetHigh affinity nerve growth factor receptor(Homo sapiens (Human))
Array Biopharma
US Patent
LigandPNGBDBM127821(US10251889, Example 195 | US10758542, Example 194 ...)
Affinity DataIC50:  4.70nM. Assay description: Trk enzymatic selectivity was assessed using Omnia™ Kinase Assay reagents from Invitrogen Corp. Enzyme (either TrkA or TrkB from Invitrogen Corp.) an...
In DepthDetails US Patent
TargetHigh affinity nerve growth factor receptor(Homo sapiens (Human))
Array Biopharma
US Patent
LigandPNGBDBM127821(US10251889, Example 195 | US10758542, Example 194 ...)
Affinity DataIC50:  7.70nM. Assay description: Trk enzymatic selectivity was assessed using Omnia™ Kinase Assay reagents from Invitrogen Corp. Enzyme (either TrkA or TrkB from Invitrogen Corp.) an...
In DepthDetails US Patent
TargetTyrosine-protein kinase JAK2 [808-1132](Homo sapiens (Human))
Array Biopharma
US Patent
LigandPNGBDBM127821(US10251889, Example 195 | US10758542, Example 194 ...)
Affinity DataIC50: >1.00E+3nM. Assay description: Compounds of Formula I were screened for their ability to inhibit Jak2 using the general enzyme inhibition assay method, in which the assay mixture c...
In DepthDetails US Patent
TargetTyrosine-protein kinase JAK2 [808-1132](Homo sapiens (Human))
Array Biopharma
US Patent
LigandPNGBDBM127821(US10251889, Example 195 | US10758542, Example 194 ...)
Affinity DataIC50: >1.00E+3nM. Assay description: Compounds of Formula I were screened for their ability to inhibit Jak2 using the general enzyme inhibition assay method, in which the assay mixture c...
In DepthDetails US Patent
TargetTyrosine-protein kinase JAK1 [866-1154](Homo sapiens (Human))
Array Biopharma
US Patent
LigandPNGBDBM127821(US10251889, Example 195 | US10758542, Example 194 ...)
Affinity DataIC50: >1.00E+3nM. Assay description: Compounds of Formula I were screened for their ability to inhibit Jak1 using the general enzyme inhibition assay method, in which the assay mixture c...
In DepthDetails US Patent
TargetTyrosine-protein kinase JAK2 [808-1132](Homo sapiens (Human))
Array Biopharma
US Patent
LigandPNGBDBM127821(US10251889, Example 195 | US10758542, Example 194 ...)
Affinity DataIC50: >1.00E+3nM. Assay description: Compounds of Formula I were screened for their ability to inhibit Jak2 using the general enzyme inhibition assay method, in which the assay mixture c...
In DepthDetails US Patent
TargetTyrosine-protein kinase JAK3 [781-1124](Homo sapiens (Human))
Array Biopharma
US Patent
LigandPNGBDBM127821(US10251889, Example 195 | US10758542, Example 194 ...)
Affinity DataIC50: >1.00E+3nM. Assay description: Compounds of Formula I were screened for their ability to inhibit Jak3 using the general enzyme inhibition assay method, in which the assay mixture c...
In DepthDetails US Patent
TargetNon-receptor tyrosine-protein kinase TYK2(Homo sapiens (Human))
Array Biopharma
US Patent
LigandPNGBDBM127821(US10251889, Example 195 | US10758542, Example 194 ...)
Affinity DataIC50: >1.00E+3nM. Assay description: Compounds of Formula I were screened for their ability to inhibit Tyk2 using the general enzyme inhibition assay method, in which the assay mixture c...
In DepthDetails US Patent
TargetHigh affinity nerve growth factor receptor(Homo sapiens (Human))
Array Biopharma
US Patent
LigandPNGBDBM127821(US10251889, Example 195 | US10758542, Example 194 ...)
Affinity DataIC50:  4.70nM. Assay description: An enzyme-linked immunosorbant assay (ELISA) was used to assess TrkA kinase activity in the presence of inhibitors. Immulon 4HBX 384-well microtiter ...
In DepthDetails US Patent
TargetTyrosine-protein kinase JAK2 [808-1132](Homo sapiens (Human))
Array Biopharma
US Patent
LigandPNGBDBM127821(US10251889, Example 195 | US10758542, Example 194 ...)
Affinity DataIC50: >1.00E+3nM. Assay description: Jak2: Compounds of Formula I were screened for their ability to inhibit Jak2 using the general enzyme inhibition assay method, in which the assay mix...
In DepthDetails US Patent
TargetHigh affinity nerve growth factor receptor(Homo sapiens (Human))
Array Biopharma
US Patent
LigandPNGBDBM127821(US10251889, Example 195 | US10758542, Example 194 ...)
Affinity DataIC50:  7.70nM. Assay description: An enzyme-linked immunosorbant assay (ELISA) was used to assess TrkA kinase activity in the presence of inhibitors. Immulon 4HBX 384-well microtiter ...
In DepthDetails US Patent
TargetTyrosine-protein kinase JAK2 [808-1132](Homo sapiens (Human))
Array Biopharma
US Patent
LigandPNGBDBM127821(US10251889, Example 195 | US10758542, Example 194 ...)
Affinity DataIC50: >1.00E+3nM. Assay description: Jak2: Compounds of Formula I were screened for their ability to inhibit Jak2 using the general enzyme inhibition assay method, in which the assay mix...
In DepthDetails US Patent
TargetHigh affinity nerve growth factor receptor(Homo sapiens (Human))
Array Biopharma
US Patent
LigandPNGBDBM127821(US10251889, Example 195 | US10758542, Example 194 ...)
Affinity DataIC50:  4.60nM. Assay description: Trk enzymatic selectivity was assessed using Omnia™ Kinase Assay reagents from Invitrogen Corp. Enzyme (either TrkA or TrkB from Invitrogen Corp.) an...
In DepthDetails US Patent
TargetTyrosine-protein kinase JAK1 [866-1154](Homo sapiens (Human))
Array Biopharma
US Patent
LigandPNGBDBM127821(US10251889, Example 195 | US10758542, Example 194 ...)
Affinity DataIC50: >1.00E+3nM. Assay description: Jak1: Compounds of Formula I were screened for their ability to inhibit Jak1 using the general enzyme inhibition assay method, in which the assay mix...
In DepthDetails US Patent
TargetTyrosine-protein kinase JAK2 [808-1132](Homo sapiens (Human))
Array Biopharma
US Patent
LigandPNGBDBM127821(US10251889, Example 195 | US10758542, Example 194 ...)
Affinity DataIC50: >1.00E+3nM. Assay description: Jak2: Compounds of Formula I were screened for their ability to inhibit Jak2 using the general enzyme inhibition assay method, in which the assay mix...
In DepthDetails US Patent
TargetTyrosine-protein kinase JAK3 [781-1124](Homo sapiens (Human))
Array Biopharma
US Patent
LigandPNGBDBM127821(US10251889, Example 195 | US10758542, Example 194 ...)
Affinity DataIC50: >1.00E+3nM. Assay description: Jak3: Compounds of Formula I were screened for their ability to inhibit Jak3 using the general enzyme inhibition assay method, in which the assay mix...
In DepthDetails US Patent
TargetTyrosine-protein kinase JAK2(Homo sapiens (Human))
Array Biopharma
US Patent
LigandPNGBDBM127821(US10251889, Example 195 | US10758542, Example 194 ...)
Affinity DataIC50: >1.00E+3nM. Assay description: Compounds of Formula I were screened for their ability to inhibit Jak2 using the general enzyme inhibition assay method, in which the assay mixture c...
In DepthDetails US Patent