BDBM127950 US8796310, 1S
SMILES Cc1nnc(o1)-c1ccnc(Nc2cc(C)cc(n2)-c2cnc(s2)C2(O)CCCc3cc(ccc23)C(O)=O)c1
InChI Key InChIKey=MBQJUGGJAMEUOI-UHFFFAOYSA-N
Data  1 IC50
  Tab Delimited (TSV)   2D SDfile   Computed 3D by Vconf -m prep SDfile
Find this compound or compounds like it in BindingDB:
Activity Spreadsheet -- Enzyme Inhibition Constant Data from BindingDB
Found 1 hit for monomerid = 127950
TargetTyrosine-protein kinase SYK(Homo sapiens (Human))
Merck Sharp & Dohme
US Patent
LigandPNGBDBM127950(US8796310, 1S)
Affinity DataIC50: <0.5nMpH: 7.5Assay Description:A recombinant GST-hSyk fusion protein was used to measure potency of compounds to inhibit human Syk activity. The recombinant human GST-Syk (Cama Bio...
In DepthDetails US Patent