BDBM127965 US8796310, 12A
SMILES Cc1cc(Nc2cc(cc[nH+]2)C(F)(F)F)nc(-c2cnc(s2)[C@@]2(O)CCCc3cc(ccc23)C(O)=O)c1Br
InChI Key InChIKey=NKZVAYATLJGLCB-RUZDIDTESA-O
Data  1 IC50
  Tab Delimited (TSV)   2D SDfile   Computed 3D by Vconf -m prep SDfile
Find this compound or compounds like it in BindingDB:
Activity Spreadsheet -- Enzyme Inhibition Constant Data from BindingDB
Found 1 hit for monomerid = 127965
TargetTyrosine-protein kinase SYK(Homo sapiens (Human))
Merck Sharp & Dohme
US Patent
LigandPNGBDBM127965(US8796310, 12A)
Affinity DataIC50: <0.5nMpH: 7.5Assay Description:A recombinant GST-hSyk fusion protein was used to measure potency of compounds to inhibit human Syk activity. The recombinant human GST-Syk (Cama Bio...
In DepthDetails US Patent