BDBM128006 US8796310, 27A
SMILES Cc1cc(Nc2cc(ccn2)C(F)(F)F)nc(c1)-c1cnc(s1)[C@@]1(N)CCCc2cc(ccc12)C(O)=O
InChI Key InChIKey=REBVQEZFKMRYTN-RUZDIDTESA-N
Data  1 IC50
  Tab Delimited (TSV)   2D SDfile   Computed 3D by Vconf -m prep SDfile
Find this compound or compounds like it in BindingDB:
Activity Spreadsheet -- Enzyme Inhibition Constant Data from BindingDB
Found 1 hit for monomerid = 128006
TargetTyrosine-protein kinase SYK(Homo sapiens (Human))
Merck Sharp & Dohme
US Patent
LigandPNGBDBM128006(US8796310, 27A)
Affinity DataIC50: <0.5nMpH: 7.5Assay Description:A recombinant GST-hSyk fusion protein was used to measure potency of compounds to inhibit human Syk activity. The recombinant human GST-Syk (Cama Bio...
In DepthDetails US Patent