BDBM128013 US8796310, 1A
SMILES Cc1cc(Nc2cc(ccn2)C(F)F)nc(c1)-c1cnc(s1)C1(O)CCCc2cc(ccc12)C(O)=O
InChI Key InChIKey=IPCWPMKGLFZOGM-UHFFFAOYSA-N
Data  1 IC50
  Tab Delimited (TSV)   2D SDfile   Computed 3D by Vconf -m prep SDfile
Find this compound or compounds like it in BindingDB:
Activity Spreadsheet -- Enzyme Inhibition Constant Data from BindingDB
Found 1 hit for monomerid = 128013
TargetTyrosine-protein kinase SYK(Homo sapiens (Human))
Merck Sharp & Dohme
US Patent
LigandPNGBDBM128013(US8796310, 1A)
Affinity DataIC50: <0.5nMpH: 7.5Assay Description:A recombinant GST-hSyk fusion protein was used to measure potency of compounds to inhibit human Syk activity. The recombinant human GST-Syk (Cama Bio...
In DepthDetails US Patent