BDBM128366 US8802864, 132
SMILES Fc1cc(ccc1-n1c(C[C@@H]2CCN(C2)C(=O)C2CC2)n[nH]c1=O)-c1ccc2cnccc2c1
InChI Key InChIKey=DLMYUBUNBVXNEG-INIZCTEOSA-N
Data  1 IC50
  Tab Delimited (TSV)   2D SDfile   Computed 3D by Vconf -m prep SDfile
Find this compound or compounds like it in BindingDB:
Activity Spreadsheet -- Enzyme Inhibition Constant Data from BindingDB
Found 1 hit for monomerid = 128366
TargetFatty acid synthase(Homo sapiens (Human))
Glaxosmithkline
US Patent
LigandPNGBDBM128366(US8802864, 132)
Affinity DataIC50:  3nMpH: 7.0Assay Description:Assay #1:Inhibition of FAS activity can be measured based on the detection of residual NADPH substrate after the FAS assay is quenched. This assay is...
In DepthDetails US Patent