BDBM129582 US8802663, 79
SMILES CC(C)Cn1ncc(-c2nc(no2)-c2ccc(CN3CC(C3)C(O)=O)cc2)c1-c1ccncc1
InChI Key InChIKey=CWGKSOFDLUEKHW-UHFFFAOYSA-N
Data  1 KI
  Tab Delimited (TSV)   2D SDfile   Computed 3D by Vconf -m prep SDfile
Find this compound or compounds like it in BindingDB:
Activity Spreadsheet -- Enzyme Inhibition Constant Data from BindingDB
Found 1 hit for monomerid = 129582
TargetSphingosine 1-phosphate receptor 1(Homo sapiens (Human))
Merck Serono
US Patent
LigandPNGBDBM129582(US8802663, 79)
Affinity DataKi:  2.30nM ΔG°:  -10.9kcal/molepH: 7.4 T: 2°C. Assay description: Receptor binding assay: Membranes were prepared from CHO cells expressing S1P1 or S1P3 for use in ligand and 355-GTPgammaS binding studies. Cells wer...
In DepthDetails US Patent