BDBM1308 2-pyridinone deriv. 26::3-Aminopyridin-2(1H)-one analogue 28::5-ethyl-6-methyl-3-[(pyridin-3-ylmethyl)amino]-1,2-dihydropyridin-2-one::CHEMBL85975
SMILES CCc1cc(NCc2cccnc2)c(=O)[nH]c1C
InChI Key InChIKey=PNCQHPWMBIIGAP-UHFFFAOYSA-N
Data  3 IC50
  Tab Delimited (TSV)   2D SDfile   Computed 3D by Vconf -m prep SDfile
Find this compound or compounds like it in BindingDB:
Activity Spreadsheet -- Enzyme Inhibition Constant Data from BindingDB
Found 3 hits for monomerid = 1308
TargetGag-Pol polyprotein [588-1027]/[588-1147](Human immunodeficiency virus type 1)
Merck Research Laboratories
LigandPNGBDBM1308(2-pyridinone deriv. 26 | 3-Aminopyridin-2(1H)-one ...)
Affinity DataIC50:  3.00E+5nMpH: 8.2Assay Description:The IC50 of reverse transcriptase is the concentration that inhibits 50% of recombinant HIV-1 RT RNA-directed DNA polymerase activity in vitro.
In DepthDetails ArticlePubMed
TargetReverse transcriptase/RNaseH(Human immunodeficiency virus 1)
Organon Research And Development Group
Curated by ChEMBL
LigandPNGBDBM1308(2-pyridinone deriv. 26 | 3-Aminopyridin-2(1H)-one ...)
Affinity DataIC50:  3.02E+5nM. Assay description: Inhibition of HIV-1 reverse transcriptase (HIV-1 RT)
In DepthDetails ArticlePubMed
TargetGag-Pol polyprotein [588-1027]/[588-1147](Human immunodeficiency virus type 1)
Merck Research Laboratories
LigandPNGBDBM1308(2-pyridinone deriv. 26 | 3-Aminopyridin-2(1H)-one ...)
Affinity DataIC50:  3.00E+5nMpH: 8.2Assay Description:The IC50 of reverse transcriptase is the concentration that inhibits 50% of recombinant HIV-1 RT RNA-directed DNA polymerase activity in vitro.
In DepthDetails ArticlePubMed