BDBM13106 CGS 27023A Analog 34::N-hydroxy-2-[(4-methoxybenzene)[(4-phenylphenyl)methyl]sulfonamido]acetamide
SMILES COc1ccc(cc1)S(=O)(=O)N(CC(=O)NO)Cc1ccc(cc1)-c1ccccc1
InChI Key InChIKey=PZGRHNUIXLWAPW-UHFFFAOYSA-N
Data  1 KI
  Tab Delimited (TSV)   2D SDfile   Computed 3D by Vconf -m prep SDfile
Find this compound or compounds like it in BindingDB:
Activity Spreadsheet -- Enzyme Inhibition Constant Data from BindingDB
Found 1 hit for monomerid = 13106
TargetStromelysin-1(Homo sapiens (Human))
Novartis Pharmaceuticals
LigandPNGBDBM13106(CGS 27023A Analog 34 | N-hydroxy-2-[(4-methoxybenz...)
Affinity DataKi:  107nM. Assay description: Stromelysin inhibitory activity is based on the hydrolysis of substance P by recombinant human stromelysin to generate a fragment, substance P 7-11, ...
In DepthDetails ArticlePubMed