BDBM132108 USRE45173, 18A
SMILES Cc1ccncc1N1CCN(C1=O)c1ccc(F)cc1
InChI Key InChIKey=YORXYVZCETZSPD-UHFFFAOYSA-N
Data  2 IC50
  Tab Delimited (TSV)   2D SDfile   Computed 3D by Vconf -m prep SDfile
Find this compound or compounds like it in BindingDB:
Activity Spreadsheet -- Enzyme Inhibition Constant Data from BindingDB
Found 2 hits for monomerid = 132108
TargetSteroid 17-alpha-hydroxylase/17,20 lyase(Rattus norvegicus (Rat))
Novartis
US Patent
LigandPNGBDBM132108(USRE45173, 18A)
Affinity DataIC50:  12nM. Assay description: Cytochrome P450, 17-20 lyase (CYP17-lyase) assay development using recombinant human CYP17 enzyme and 17-alpha -hydroxy pregnenolone [21-3H] as the s...
In DepthDetails US Patent
TargetSteroid 17-alpha-hydroxylase/17,20 lyase(Homo sapiens (Human))
Novartis
US Patent
LigandPNGBDBM132108(USRE45173, 18A)
Affinity DataIC50:  76nM. Assay description: Cytochrome P450, 17-20 lyase (CYP17-lyase) assay development using recombinant human CYP17 enzyme and 17-alpha -hydroxy pregnenolone [21-3H] as the s...
In DepthDetails US Patent