BDBM1322 3-Aminopyridin-2(1H)-one analogue 42::3-{[(7-chloro-4-fluoro-1,3-benzoxazol-2-yl)methyl]amino}-5-ethyl-6-methyl-1,2-dihydropyridin-2-one
SMILES CCc1cc(NCc2nc3c(F)ccc(Cl)c3o2)c(=O)[nH]c1C
InChI Key InChIKey=JIXOGQNMWSOKEX-UHFFFAOYSA-N
Data  1 IC50
  Tab Delimited (TSV)   2D SDfile   Computed 3D by Vconf -m prep SDfile
Find this compound or compounds like it in BindingDB:
Activity Spreadsheet -- Enzyme Inhibition Constant Data from BindingDB
Found 1 hit for monomerid = 1322
TargetGag-Pol polyprotein [588-1027]/[588-1147](Human immunodeficiency virus type 1)
Merck Research Laboratories
LigandPNGBDBM1322(3-Aminopyridin-2(1H)-one analogue 42 | 3-{[(7-chlo...)
Affinity DataIC50:  105nM. Assay description: The IC50 of reverse transcriptase is the concentration that inhibits 50% of recombinant HIV-1 RT RNA-directed DNA polymerase activity in vitro.
In DepthDetails ArticlePubMed