BDBM132305 US8841312, 48
SMILES C1CCC(C1)n1c2cnccc2c2cnc(Nc3ccc(cn3)N3CCCNCC3)nc12
InChI Key InChIKey=JUQKGEXKBSXXHM-UHFFFAOYSA-N
Data  2 IC50
  Tab Delimited (TSV)   2D SDfile   Computed 3D by Vconf -m prep SDfile
Find this compound or compounds like it in BindingDB:
Activity Spreadsheet -- Enzyme Inhibition Constant Data from BindingDB
Found 2 hits for monomerid = 132305
TargetCyclin-dependent kinase 6(Homo sapiens (Human))
Amgen
US Patent
LigandPNGBDBM132305(US8841312, 48)
Affinity DataIC50:  5.60nMpH: 7.4 T: 2°C. Assay description: The Cdk4 and Cdk6 inhibitory activity of the compounds is measured with a kinase inhibition assay using recombinant Cdk4/CyclinD1 or Cdk6/CyclinD3 pr...
In DepthDetails US Patent
TargetCyclin-dependent kinase 4(Homo sapiens (Human))
Amgen
US Patent
LigandPNGBDBM132305(US8841312, 48)
Affinity DataIC50:  1.60nMpH: 7.4 T: 2°C. Assay description: The Cdk4 and Cdk6 inhibitory activity of the compounds is measured with a kinase inhibition assay using recombinant Cdk4/CyclinD1 or Cdk6/CyclinD3 pr...
In DepthDetails US Patent