BDBM132459 US8841312, 208
SMILES CC1(C)CCC(CC1)n1c2nc(Nc3ccc(cn3)N3CCNCC3)ncc2c2ccnc(O)c12
InChI Key InChIKey=XIMWLMPVHGWMSI-UHFFFAOYSA-N
Data  1 IC50
  Tab Delimited (TSV)   2D SDfile   Computed 3D by Vconf -m prep SDfile
Find this compound or compounds like it in BindingDB:
Activity Spreadsheet -- Enzyme Inhibition Constant Data from BindingDB
Found 1 hit for monomerid = 132459
TargetCyclin-dependent kinase 4(Homo sapiens (Human))
Amgen
US Patent
LigandPNGBDBM132459(US8841312, 208)
Affinity DataIC50:  1.80nMpH: 7.4 T: 2°C. Assay description: The Cdk4 and Cdk6 inhibitory activity of the compounds is measured with a kinase inhibition assay using recombinant Cdk4/CyclinD1 or Cdk6/CyclinD3 pr...
In DepthDetails US Patent