BDBM13273 2-(6-(3-(1H-Imidazol-1-yl)propylamino)pyridin-2-ylamino)-N-(2-chloro-6-methylphenyl)-1,3-thiazole-5-carboxamide::BMS-354825 2-Heteroarylamino-thiazole Analog 12r::N-(2-chloro-6-methylphenyl)-2-[(6-{[3-(1H-imidazol-1-yl)propyl]amino}pyridin-2-yl)amino]-1,3-thiazole-5-carboxamide
SMILES Cc1cccc(Cl)c1NC(=O)c1cnc(Nc2cccc(NCCCn3ccnc3)n2)s1
InChI Key InChIKey=SJHDMDLDMVESHW-UHFFFAOYSA-N
Data  1 IC50
  Tab Delimited (TSV)   2D SDfile   Computed 3D by Vconf -m prep SDfile
Find this compound or compounds like it in BindingDB:
Activity Spreadsheet -- Enzyme Inhibition Constant Data from BindingDB
Found 1 hit for monomerid = 13273
TargetTyrosine-protein kinase Lck(Homo sapiens (Human))
Bristol-Myers Squibb
LigandPNGBDBM13273(2-(6-(3-(1H-Imidazol-1-yl)propylamino)pyridin-2-yl...)
Affinity DataIC50: <0.5nM. Assay description: IC50 is the inhibitor concentration, which inhibits 50% of kinase activity that catalyzes the transfer of the terminal phosphate from [gamma-33P] lab...
In DepthDetails ArticlePubMed