BDBM1328 3-Aminopyridin-2(1H)-one analogue 48::3-{[(4,7-dichloro-1-benzofuran-2-yl)methyl]amino}-5-ethyl-6-methyl-1,2-dihydropyridin-2-one
SMILES CCc1cc(NCc2cc3c(Cl)ccc(Cl)c3o2)c(=O)[nH]c1C
InChI Key InChIKey=VTWDQQNZHHCVKP-UHFFFAOYSA-N
Data  1 IC50
  Tab Delimited (TSV)   2D SDfile   Computed 3D by Vconf -m prep SDfile
Find this compound or compounds like it in BindingDB:
Activity Spreadsheet -- Enzyme Inhibition Constant Data from BindingDB
Found 1 hit for monomerid = 1328
TargetGag-Pol polyprotein [588-1027]/[588-1147](Human immunodeficiency virus type 1)
Merck Research Laboratories
LigandPNGBDBM1328(3-Aminopyridin-2(1H)-one analogue 48 | 3-{[(4,7-di...)
Affinity DataIC50:  57nM. Assay description: The IC50 of reverse transcriptase is the concentration that inhibits 50% of recombinant HIV-1 RT RNA-directed DNA polymerase activity in vitro.
In DepthDetails ArticlePubMed