BDBM136333 US8859534, 19
SMILES CN(Cc1cccc(c1)S(C)(=O)=O)C(=O)c1cc2cccc(N3CCN(CCc4ccccn4)CC3)c2o1
InChI Key InChIKey=BGPFUQDEHMKOKJ-UHFFFAOYSA-N
Data  2 KI
  Tab Delimited (TSV)   2D SDfile   Computed 3D by Vconf -m prep SDfile
Find this compound or compounds like it in BindingDB:
Activity Spreadsheet -- Enzyme Inhibition Constant Data from BindingDB
Found 2 hits for monomerid = 136333
Target5-hydroxytryptamine receptor 1A(Cricetulus griseus (Chinese hamster) (Cricetulus b...)
Acturum Life Science
US Patent
LigandPNGBDBM136333(US8859534, 19)
Affinity DataKi:  0.990nMpH: 7.4Assay Description:Assays that were used to measure affinity of the compounds of the present invention for 5-HT1A and 5-HT1B receptors are described in J. Recept Signal...
In DepthDetails US Patent
Target5-hydroxytryptamine receptor 1B(Cricetulus griseus (Chinese hamster) (Cricetulus b...)
Acturum Life Science
US Patent
LigandPNGBDBM136333(US8859534, 19)
Affinity DataKi:  10nMpH: 7.4Assay Description:Assays that were used to measure affinity of the compounds of the present invention for 5-HT1A and 5-HT1B receptors are described in J. Recept Signal...
In DepthDetails US Patent