BDBM136355 US8859534, 41
SMILES CN(C)C(=O)c1cc2cccc(N3CCN(CCc4cc(ccn4)C#N)CC3)c2o1
InChI Key InChIKey=FVKDRXNFIUNQBF-UHFFFAOYSA-N
Data  2 KI
  Tab Delimited (TSV)   2D SDfile   Computed 3D by Vconf -m prep SDfile
Find this compound or compounds like it in BindingDB:
Activity Spreadsheet -- Enzyme Inhibition Constant Data from BindingDB
Found 2 hits for monomerid = 136355
Target5-hydroxytryptamine receptor 1A(Cricetulus griseus (Chinese hamster) (Cricetulus b...)
Acturum Life Science
US Patent
LigandPNGBDBM136355(US8859534, 41)
Affinity DataKi:  1.30nMpH: 7.4Assay Description:Assays that were used to measure affinity of the compounds of the present invention for 5-HT1A and 5-HT1B receptors are described in J. Recept Signal...
In DepthDetails US Patent
Target5-hydroxytryptamine receptor 1B(Cricetulus griseus (Chinese hamster) (Cricetulus b...)
Acturum Life Science
US Patent
LigandPNGBDBM136355(US8859534, 41)
Affinity DataKi:  73nMpH: 7.4Assay Description:Assays that were used to measure affinity of the compounds of the present invention for 5-HT1A and 5-HT1B receptors are described in J. Recept Signal...
In DepthDetails US Patent