BDBM13806 5-(3-hydroxyphenyl)-2,3-dihydro-1,2-thiazole-1,1,3-trione::IZD 1
SMILES Oc1cccc(c1)C1=CC(=O)NS1(=O)=O
InChI Key InChIKey=FJABEDRGNJSWCC-UHFFFAOYSA-N
Data  1 IC50
PDB links: 1 PDB ID matches this monomer.
  Tab Delimited (TSV)   2D SDfile   Computed 3D by Vconf -m prep SDfile
Find this compound or compounds like it in BindingDB:
Activity Spreadsheet -- Enzyme Inhibition Constant Data from BindingDB
Found 1 hit for monomerid = 13806
LigandPNGBDBM13806(5-(3-hydroxyphenyl)-2,3-dihydro-1,2-thiazole-1,1,3...)
Affinity DataIC50:  1.35E+3nMpH: 7.0 T: 2°C. Assay description: The activity of PTP1B enzyme was assayed with 4-nitrophenyl phosphate (pNPP) as substrate. Rate of formation of the phenolate ion was monitored at 41...