BDBM138561 US8877741, 1.39
SMILES CCCOc1cnc(N2CCC(C2)Oc2ccc(cc2)[C@H](C)NC(C)=O)c(C)c1
InChI Key InChIKey=RJKNKKHLHQEWJY-PBVYKCSPSA-N
Data  1 IC50
  Tab Delimited (TSV)   2D SDfile   Computed 3D by Vconf -m prep SDfile
Find this compound or compounds like it in BindingDB:
Activity Spreadsheet -- Enzyme Inhibition Constant Data from BindingDB
Found 1 hit for monomerid = 138561
TargetAcetyl-CoA carboxylase 2(Homo sapiens (Human))
Boehringer Ingelheim International
US Patent
LigandPNGBDBM138561(US8877741, 1.39)
Affinity DataIC50:  379nMpH: 7.5Assay Description:Malonyl CoA formation by acetyl CoA carboxylases is stoichometrically linked to the consumption of ATP. ACC2 activity is measured in a NADH-linked ki...
In DepthDetails US Patent