BDBM140219 US8906911, 28
SMILES CO[C@@H]1COCC[C@@H]1N[C@@H]1C[C@H]2CCC[C@]2(C1)C(=O)N1C[C@@H]2C[C@H]1CN2c1cc(ccc1C#N)C(F)(F)F
InChI Key InChIKey=YFUWMBWUHMRNCL-BUZATDFISA-N
Data  1 KI  1 IC50
  Tab Delimited (TSV)   2D SDfile   Computed 3D by Vconf -m prep SDfile
Find this compound or compounds like it in BindingDB:
Activity Spreadsheet -- Enzyme Inhibition Constant Data from BindingDB
Found 1 hit for monomerid = 140219
TargetC-C chemokine receptor type 2(Homo sapiens (Human))
Abbvie
US Patent
LigandPNGBDBM140219(US8906911, 28)
Affinity DataKi:  32nM ΔG°:  -9.50kcal/mole IC50:  19.8nMpH: 7.4 T: 2°C. Assay description: Radioligand binding assays were performed in CHO cells expressing human CCR2B and Galpha±16 coupling protein. All compounds were dissolved in DMSO a...
In DepthDetails US Patent