BDBM140248 US8906911, 57
SMILES CO[C@@H]1COCC[C@@H]1N(C)[C@@H]1C[C@H]2CCC[C@]2(C1)C(=O)N1C[C@@H]2C[C@H]1CN2c1cc(cc(c1)C(F)(F)F)C#N
InChI Key InChIKey=NCYYLOYEOMDWAI-ZJWGYTSTSA-N
Data  1 IC50
  Tab Delimited (TSV)   2D SDfile   Computed 3D by Vconf -m prep SDfile
Find this compound or compounds like it in BindingDB:
Activity Spreadsheet -- Enzyme Inhibition Constant Data from BindingDB
Found 1 hit for monomerid = 140248
TargetC-C chemokine receptor type 2(Homo sapiens (Human))
Abbvie
US Patent
LigandPNGBDBM140248(US8906911, 57)
Affinity DataIC50:  521nMpH: 7.4 T: 2°C. Assay description: Radioligand binding assays were performed in CHO cells expressing human CCR2B and Galpha±16 coupling protein. All compounds were dissolved in DMSO a...
In DepthDetails US Patent