BDBM14084 (2S)-N-[1-(1,3-benzothiazol-2-yl)-5-carbamimidamido-1-oxopentan-2-yl]pyrrolidine-2-carboxamide::2-ketobenzothiazole 24
SMILES [#7]\[#6](-[#7])=[#7]\[#6]-[#6]-[#6]-[#6](-[#7]-[#6](=O)-[#6@@H]-1-[#6]-[#6]-[#6]-[#7]-1)-[#6](=O)-c1nc2ccccc2s1
InChI Key InChIKey=AAZRQCBNNOOVFU-ABLWVSNPSA-N
Data  1 KI  1 IC50
  Tab Delimited (TSV)   2D SDfile   Computed 3D by Vconf -m prep SDfile
Find this compound or compounds like it in BindingDB:
Activity Spreadsheet -- Enzyme Inhibition Constant Data from BindingDB
Found 2 hits for monomerid = 14084
TargetSerine protease 1(Bos taurus (bovine))
Johnson & Johnson Pharmaceutical
LigandPNGBDBM14084((2S)-N-[1-(1,3-benzothiazol-2-yl)-5-carbamimidamid...)
Affinity DataKi:  250nM. Assay description: Trypsin-catalyzed hydrolysis rates were measured spectrophotometrically using bovine trypsin, a chromogenic substrate in aqueous buffer, and a microp...
In DepthDetails ArticlePubMed
TargetProthrombin(Homo sapiens (Human))
Johnson & Johnson Pharmaceutical
LigandPNGBDBM14084((2S)-N-[1-(1,3-benzothiazol-2-yl)-5-carbamimidamid...)
Affinity DataIC50: >1.00E+5nM. Assay description: Thrombin-catalyzed hydrolysis rates were measured spectrophotometrically using human alpha-thrombin, a chromogenic substrate in aqueous buffer, and a...
In DepthDetails ArticlePubMed