BDBM14091 (2S)-N-[(2S)-1-(1,3-benzothiazol-2-yl)-3-(4-carbamimidoylphenyl)-1-oxopropan-2-yl]-1-[(2R)-2-(methylamino)-3-phenylpropanoyl]pyrrolidine-2-carboxamide::2-ketobenzothiazole 31
SMILES CN[C@H](Cc1ccccc1)C(=O)N1CCC[C@H]1C(=O)N[C@@H](Cc1ccc(cc1)C(N)=N)C(=O)c1nc2ccccc2s1
InChI Key InChIKey=ZPJOWKKJECJXID-NXCFDTQHSA-N
Data  1 KI  2 IC50
  Tab Delimited (TSV)   2D SDfile   Computed 3D by Vconf -m prep SDfile
Find this compound or compounds like it in BindingDB:
Activity Spreadsheet -- Enzyme Inhibition Constant Data from BindingDB
Found 2 hits for monomerid = 14091
TargetProthrombin(Homo sapiens (Human))
Johnson & Johnson Pharmaceutical
LigandPNGBDBM14091((2S)-N-[(2S)-1-(1,3-benzothiazol-2-yl)-3-(4-carbam...)
Affinity DataKi:  1.40E+3nM IC50: >1.00E+3nM. Assay description: Thrombin-catalyzed hydrolysis rates were measured spectrophotometrically using human alpha-thrombin, a chromogenic substrate in aqueous buffer, and a...
In DepthDetails ArticlePubMed
TargetSerine protease 1(Bos taurus (bovine))
Johnson & Johnson Pharmaceutical
LigandPNGBDBM14091((2S)-N-[(2S)-1-(1,3-benzothiazol-2-yl)-3-(4-carbam...)
Affinity DataIC50:  540nM. Assay description: Trypsin-catalyzed hydrolysis rates were measured spectrophotometrically using bovine trypsin, a chromogenic substrate in aqueous buffer, and a microp...
In DepthDetails ArticlePubMed