BDBM140958 US8916553, 198
SMILES Cc1cc(NS(C)(=O)=O)ccc1-c1cnccc1OCC(F)(F)F
InChI Key InChIKey=AENATPIHQUMFQT-UHFFFAOYSA-N
Data  1 IC50
  Tab Delimited (TSV)   2D SDfile   Computed 3D by Vconf -m prep SDfile
Find this compound or compounds like it in BindingDB:
Activity Spreadsheet -- Enzyme Inhibition Constant Data from BindingDB
Found 1 hit for monomerid = 140958
TargetSteroid 17-alpha-hydroxylase/17,20 lyase(Homo sapiens (Human))
Bristol-Myers Squibb
US Patent
LigandPNGBDBM140958(US8916553, 198)
Affinity DataIC50:  1.40nMpH: 7.2 T: 2°C. Assay description: The assays were performed in U-bottom 384-well optiplates. The final assay volume was 15 ul prepared from 7.5 ul additions of microsomes (prepared as...
Ligand InfoPC cidPC sid
In DepthDetails US Patent