BDBM14352 2-{5-[amino(iminiumyl)methyl]-6-chloro-1H-indol-2-yl}-4-(dimethylcarbamoyl)-6-phenylbenzen-1-olate::CRA-11852
SMILES CN(C)C(=O)c1cc(-c2cc3cc(C(N)=[NH2+])c(Cl)cc3[nH]2)c([O-])c(c1)-c1ccccc1
InChI Key InChIKey=FIKPJJWWHHKTHI-UHFFFAOYSA-N
Data  4 KI
  Tab Delimited (TSV)   2D SDfile   Computed 3D by Vconf -m prep SDfile
Find this compound or compounds like it in BindingDB:
Activity Spreadsheet -- Enzyme Inhibition Constant Data from BindingDB
Found 4 hits for monomerid = 14352
TargetUrokinase-type plasminogen activator(Homo sapiens (Human))
Celera
LigandPNGBDBM14352(2-{5-[amino(iminiumyl)methyl]-6-chloro-1H-indol-2-...)
Affinity DataKi:  2.20nM. Assay description: Each enzyme was assayed with a set of different concentrations of each inhibitor. After addition of the appropriate substrate, the rate of hydrolysis...
In DepthDetails ArticlePubMed
TargetSerine protease 1(Homo sapiens (Human))
Celera
LigandPNGBDBM14352(2-{5-[amino(iminiumyl)methyl]-6-chloro-1H-indol-2-...)
Affinity DataKi:  190nM. Assay description: Each enzyme was assayed with a set of different concentrations of each inhibitor. After addition of the appropriate substrate, the rate of hydrolysis...
In DepthDetails ArticlePubMed
TargetCoagulation factor X(Homo sapiens (Human))
Celera
LigandPNGBDBM14352(2-{5-[amino(iminiumyl)methyl]-6-chloro-1H-indol-2-...)
Affinity DataKi:  8.00E+3nM. Assay description: Each enzyme was assayed with a set of different concentrations of each inhibitor. After addition of the appropriate substrate, the rate of hydrolysis...
In DepthDetails ArticlePubMed
TargetProthrombin(Homo sapiens (Human))
Celera
LigandPNGBDBM14352(2-{5-[amino(iminiumyl)methyl]-6-chloro-1H-indol-2-...)
Affinity DataKi:  3.30E+4nM. Assay description: Each enzyme was assayed with a set of different concentrations of each inhibitor. After addition of the appropriate substrate, the rate of hydrolysis...
In DepthDetails ArticlePubMed