BDBM143750 US10183953, Example 86::US8969352, 11::US8969352, 27::US9611277, Example 86::US9845333, 27
SMILES Fc1cccc(C(=O)N2CC3CC(Oc4ccc(cn4)C(F)(F)F)C2C3)c1-c1ncccn1
InChI Key InChIKey=HUKWIAXQBOHZIX-UHFFFAOYSA-N
Data  48 KI
  Tab Delimited (TSV)   2D SDfile   Computed 3D by Vconf -m prep SDfile
Find this compound or compounds like it in BindingDB:
Activity Spreadsheet -- Enzyme Inhibition Constant Data from BindingDB
Found 48 hits for monomerid = 143750
TargetOrexin/Hypocretin receptor type 1(Rattus norvegicus (Rat))
Janssen Pharmaceutica
US Patent
LigandPNGBDBM143750(US10183953, Example 86 | US8969352, 11 | US8969352...)
Affinity DataKi:  4nM. Assay description: Human Embryonic Kidney 293 cells (HEK293) stably expressing rat orexin 1 receptor (Genebank accession number NM_001525) or Chinese ovary cells (CHO) ...
In DepthDetails US Patent
TargetOrexin/Hypocretin receptor type 1(Homo sapiens (Human))
TBA
US Patent
LigandPNGBDBM143750(US10183953, Example 86 | US8969352, 11 | US8969352...)
Affinity DataKi:  4nM. Assay description: Rat and Human Orexin 1 Receptor:Human Embryonic Kidney 293 cells (HEK293) stably expressing rat orexin 1 receptor (Genebank accession number NM_00152...
In DepthDetails US Patent
TargetOrexin/Hypocretin receptor type 1(Homo sapiens (Human))
TBA
US Patent
LigandPNGBDBM143750(US10183953, Example 86 | US8969352, 11 | US8969352...)
Affinity DataKi:  4nM ΔG°:  -10.6kcal/moleT: 2°C. Assay description: Human Embryonic Kidney 293 cells (HEK293) stably expressing rat orexin 1 receptor (Genebank accession number NM 001525) or Chinese ovary cells (CHO) ...
In DepthDetails US Patent
TargetOrexin/Hypocretin receptor type 1(Rattus norvegicus (Rat))
Janssen Pharmaceutica
US Patent
LigandPNGBDBM143750(US10183953, Example 86 | US8969352, 11 | US8969352...)
Affinity DataKi:  4nM. Assay description: Rat and Human Orexin 1 Receptor:Human Embryonic Kidney 293 cells (HEK293) stably expressing rat orexin 1 receptor (Genebank accession number NM_00152...
In DepthDetails US Patent
TargetOrexin/Hypocretin receptor type 1(Homo sapiens (Human))
TBA
US Patent
LigandPNGBDBM143750(US10183953, Example 86 | US8969352, 11 | US8969352...)
Affinity DataKi:  4nM. Assay description: CHO cells stably transfected with the human orexin 1 receptor (Genebank accession number NM_001526) were grown to confluency in DMEM/F12, 10% FBS, 1×...
In DepthDetails US Patent
TargetOrexin/Hypocretin receptor type 1(Homo sapiens (Human))
TBA
US Patent
LigandPNGBDBM143750(US10183953, Example 86 | US8969352, 11 | US8969352...)
Affinity DataKi:  4nM. Assay description: HEK293 stably expressing human orexin 2 receptor (Genebank accession number NM_001526) were grown to confluency in DMEM (Hyclone, cat # SH30022), 10%...
In DepthDetails US Patent
TargetOrexin/Hypocretin receptor type 1(Rattus norvegicus (Rat))
Janssen Pharmaceutica
US Patent
LigandPNGBDBM143750(US10183953, Example 86 | US8969352, 11 | US8969352...)
Affinity DataKi:  4nM. Assay description: Human Embryonic Kidney 293 cells (HEK293) stably expressing rat orexin 1 receptor (Genebank accession number NM_001525) or Chinese ovary cells (CHO) ...
In DepthDetails US Patent
TargetOrexin/Hypocretin receptor type 1(Rattus norvegicus (Rat))
Janssen Pharmaceutica
US Patent
LigandPNGBDBM143750(US10183953, Example 86 | US8969352, 11 | US8969352...)
Affinity DataKi:  4nM ΔG°:  -10.6kcal/moleT: 2°C. Assay description: Human Embryonic Kidney 293 cells (HEK293) stably expressing rat orexin 1 receptor (Genebank accession number NM 001525) or Chinese ovary cells (CHO) ...
In DepthDetails US Patent
TargetOrexin/Hypocretin receptor type 1(Homo sapiens (Human))
TBA
US Patent
LigandPNGBDBM143750(US10183953, Example 86 | US8969352, 11 | US8969352...)
Affinity DataKi:  5nM. Assay description: CHO cells stably transfected with the human orexin 1 receptor (Genebank accession number NM_001526) were grown to confluency in DMEM/F12, 10% FBS, 1×...
In DepthDetails US Patent
TargetOrexin/Hypocretin receptor type 1(Homo sapiens (Human))
TBA
US Patent
LigandPNGBDBM143750(US10183953, Example 86 | US8969352, 11 | US8969352...)
Affinity DataKi:  5nM. Assay description: HEK293 stably expressing human orexin 2 receptor (Genebank accession number NM_001526) were grown to confluency in DMEM (Hyclone, cat # SH30022), 10%...
In DepthDetails US Patent
TargetOrexin/Hypocretin receptor type 1(Homo sapiens (Human))
TBA
US Patent
LigandPNGBDBM143750(US10183953, Example 86 | US8969352, 11 | US8969352...)
Affinity DataKi:  6nM. Assay description: CHO cells stably transfected with the human orexin 1 receptor (Genebank accession number NM_001526) were grown to confluency in DMEM/F12, 10% FBS, 1×...
In DepthDetails US Patent
TargetOrexin/Hypocretin receptor type 1(Rattus norvegicus (Rat))
Janssen Pharmaceutica
US Patent
LigandPNGBDBM143750(US10183953, Example 86 | US8969352, 11 | US8969352...)
Affinity DataKi:  6nM. Assay description: Human Embryonic Kidney 293 cells (HEK293) stably expressing rat orexin 1 receptor (Genebank accession number NM_001525) or Chinese ovary cells (CHO) ...
In DepthDetails US Patent
TargetOrexin/Hypocretin receptor type 1(Rattus norvegicus (Rat))
Janssen Pharmaceutica
US Patent
LigandPNGBDBM143750(US10183953, Example 86 | US8969352, 11 | US8969352...)
Affinity DataKi:  6nM. Assay description: Human Embryonic Kidney 293 cells (HEK293) stably expressing rat orexin 1 receptor (Genebank accession number NM_001525) or Chinese ovary cells (CHO) ...
In DepthDetails US Patent
TargetOrexin/Hypocretin receptor type 1(Rattus norvegicus (Rat))
Janssen Pharmaceutica
US Patent
LigandPNGBDBM143750(US10183953, Example 86 | US8969352, 11 | US8969352...)
Affinity DataKi:  6nM. Assay description: Human Embryonic Kidney 293 cells (HEK293) stably expressing rat orexin 1 receptor (Genebank accession number NM_001525) or Chinese ovary cells (CHO) ...
In DepthDetails US Patent
TargetOrexin/Hypocretin receptor type 1(Rattus norvegicus (Rat))
Janssen Pharmaceutica
US Patent
LigandPNGBDBM143750(US10183953, Example 86 | US8969352, 11 | US8969352...)
Affinity DataKi:  6nM. Assay description: Human Embryonic Kidney 293 cells (HEK293) stably expressing rat orexin 1 receptor (Genebank accession number NM_001525) or Chinese ovary cells (CHO) ...
In DepthDetails US Patent
TargetOrexin/Hypocretin receptor type 1(Homo sapiens (Human))
TBA
US Patent
LigandPNGBDBM143750(US10183953, Example 86 | US8969352, 11 | US8969352...)
Affinity DataKi:  6nM. Assay description: HEK293 stably expressing human orexin 2 receptor (Genebank accession number NM_001526) were grown to confluency in DMEM (Hyclone, cat # SH30022), 10%...
In DepthDetails US Patent
TargetOrexin/Hypocretin receptor type 1(Rattus norvegicus (Rat))
Janssen Pharmaceutica
US Patent
LigandPNGBDBM143750(US10183953, Example 86 | US8969352, 11 | US8969352...)
Affinity DataKi:  7nM. Assay description: Human Embryonic Kidney 293 cells (HEK293) stably expressing rat orexin 1 receptor (Genebank accession number NM_001525) or Chinese ovary cells (CHO) ...
In DepthDetails US Patent
TargetOrexin/Hypocretin receptor type 1(Rattus norvegicus (Rat))
Janssen Pharmaceutica
US Patent
LigandPNGBDBM143750(US10183953, Example 86 | US8969352, 11 | US8969352...)
Affinity DataKi:  7nM. Assay description: Human Embryonic Kidney 293 cells (HEK293) stably expressing rat orexin 1 receptor (Genebank accession number NM_001525) or Chinese ovary cells (CHO) ...
In DepthDetails US Patent
TargetOrexin/Hypocretin receptor type 1(Homo sapiens (Human))
TBA
US Patent
LigandPNGBDBM143750(US10183953, Example 86 | US8969352, 11 | US8969352...)
Affinity DataKi:  8nM. Assay description: HEK293 stably expressing human orexin 2 receptor (Genebank accession number NM_001526) were grown to confluency in DMEM (Hyclone, cat # SH30022), 10%...
In DepthDetails US Patent
TargetOrexin/Hypocretin receptor type 1(Homo sapiens (Human))
TBA
US Patent
LigandPNGBDBM143750(US10183953, Example 86 | US8969352, 11 | US8969352...)
Affinity DataKi:  8nM ΔG°:  -10.3kcal/moleT: 2°C. Assay description: Human Embryonic Kidney 293 cells (HEK293) stably expressing rat orexin 1 receptor (Genebank accession number NM 001525) or Chinese ovary cells (CHO) ...
In DepthDetails US Patent
TargetOrexin/Hypocretin receptor type 1(Homo sapiens (Human))
TBA
US Patent
LigandPNGBDBM143750(US10183953, Example 86 | US8969352, 11 | US8969352...)
Affinity DataKi:  8nM. Assay description: Rat and Human Orexin 1 Receptor:Human Embryonic Kidney 293 cells (HEK293) stably expressing rat orexin 1 receptor (Genebank accession number NM_00152...
In DepthDetails US Patent
TargetOrexin/Hypocretin receptor type 1(Homo sapiens (Human))
TBA
US Patent
LigandPNGBDBM143750(US10183953, Example 86 | US8969352, 11 | US8969352...)
Affinity DataKi:  8nM. Assay description: CHO cells stably transfected with the human orexin 1 receptor (Genebank accession number NM_001526) were grown to confluency in DMEM/F12, 10% FBS, 1×...
In DepthDetails US Patent
TargetOrexin/Hypocretin receptor type 1(Homo sapiens (Human))
TBA
US Patent
LigandPNGBDBM143750(US10183953, Example 86 | US8969352, 11 | US8969352...)
Affinity DataKi:  9nM. Assay description: HEK293 stably expressing human orexin 2 receptor (Genebank accession number NM_001526) were grown to confluency in DMEM (Hyclone, cat # SH30022), 10%...
In DepthDetails US Patent
TargetOrexin/Hypocretin receptor type 1(Homo sapiens (Human))
TBA
US Patent
LigandPNGBDBM143750(US10183953, Example 86 | US8969352, 11 | US8969352...)
Affinity DataKi:  9nM. Assay description: CHO cells stably transfected with the human orexin 1 receptor (Genebank accession number NM_001526) were grown to confluency in DMEM/F12, 10% FBS, 1×...
In DepthDetails US Patent
TargetOrexin/Hypocretin receptor type 1(Homo sapiens (Human))
TBA
US Patent
LigandPNGBDBM143750(US10183953, Example 86 | US8969352, 11 | US8969352...)
Affinity DataKi:  9nM. Assay description: HEK293 stably expressing human orexin 2 receptor (Genebank accession number NM_001526) were grown to confluency in DMEM (Hyclone, cat # SH30022), 10%...
In DepthDetails US Patent
TargetOrexin/Hypocretin receptor type 1(Homo sapiens (Human))
TBA
US Patent
LigandPNGBDBM143750(US10183953, Example 86 | US8969352, 11 | US8969352...)
Affinity DataKi:  9nM. Assay description: CHO cells stably transfected with the human orexin 1 receptor (Genebank accession number NM_001526) were grown to confluency in DMEM/F12, 10% FBS, 1×...
In DepthDetails US Patent
TargetOrexin/Hypocretin receptor type 1(Rattus norvegicus (Rat))
Janssen Pharmaceutica
US Patent
LigandPNGBDBM143750(US10183953, Example 86 | US8969352, 11 | US8969352...)
Affinity DataKi:  11nM. Assay description: Rat and Human Orexin 1 Receptor:Human Embryonic Kidney 293 cells (HEK293) stably expressing rat orexin 1 receptor (Genebank accession number NM_00152...
In DepthDetails US Patent
TargetOrexin/Hypocretin receptor type 1(Rattus norvegicus (Rat))
Janssen Pharmaceutica
US Patent
LigandPNGBDBM143750(US10183953, Example 86 | US8969352, 11 | US8969352...)
Affinity DataKi:  11nM. Assay description: Human Embryonic Kidney 293 cells (HEK293) stably expressing rat orexin 1 receptor (Genebank accession number NM_001525) or Chinese ovary cells (CHO) ...
In DepthDetails US Patent
TargetOrexin/Hypocretin receptor type 1(Rattus norvegicus (Rat))
Janssen Pharmaceutica
US Patent
LigandPNGBDBM143750(US10183953, Example 86 | US8969352, 11 | US8969352...)
Affinity DataKi:  11nM. Assay description: Human Embryonic Kidney 293 cells (HEK293) stably expressing rat orexin 1 receptor (Genebank accession number NM_001525) or Chinese ovary cells (CHO) ...
In DepthDetails US Patent
TargetOrexin/Hypocretin receptor type 1(Rattus norvegicus (Rat))
Janssen Pharmaceutica
US Patent
LigandPNGBDBM143750(US10183953, Example 86 | US8969352, 11 | US8969352...)
Affinity DataKi:  11nM. Assay description: Human Embryonic Kidney 293 cells (HEK293) stably expressing rat orexin 1 receptor (Genebank accession number NM_001525) or Chinese ovary cells (CHO) ...
In DepthDetails US Patent
TargetOrexin/Hypocretin receptor type 1(Rattus norvegicus (Rat))
Janssen Pharmaceutica
US Patent
LigandPNGBDBM143750(US10183953, Example 86 | US8969352, 11 | US8969352...)
Affinity DataKi:  11nM. Assay description: Human Embryonic Kidney 293 cells (HEK293) stably expressing rat orexin 1 receptor (Genebank accession number NM_001525) or Chinese ovary cells (CHO) ...
In DepthDetails US Patent
TargetOrexin/Hypocretin receptor type 1(Rattus norvegicus (Rat))
Janssen Pharmaceutica
US Patent
LigandPNGBDBM143750(US10183953, Example 86 | US8969352, 11 | US8969352...)
Affinity DataKi:  11nM ΔG°:  -10.1kcal/moleT: 2°C. Assay description: Human Embryonic Kidney 293 cells (HEK293) stably expressing rat orexin 1 receptor (Genebank accession number NM 001525) or Chinese ovary cells (CHO) ...
In DepthDetails US Patent
TargetOrexin receptor type 2(Homo sapiens (Human))
Janssen Pharmaceutica
US Patent
LigandPNGBDBM143750(US10183953, Example 86 | US8969352, 11 | US8969352...)
Affinity DataKi:  725nM. Assay description: HEK293 stably expressing human orexin 2 receptor (Genebank accession number NM_001526) were grown to confluency in DMEM (Hyclone, cat # SH30022), 10%...
In DepthDetails US Patent
TargetOrexin receptor type 2(Homo sapiens (Human))
Janssen Pharmaceutica
US Patent
LigandPNGBDBM143750(US10183953, Example 86 | US8969352, 11 | US8969352...)
Affinity DataKi:  725nM. Assay description: PFSK-1 cells endogenously expressing the human orexin 2 receptor were grown to confluency in RPMI1640 (Hyclone, cat #30027.02), 10% FBS, 1× pen-strep...
In DepthDetails US Patent
TargetOrexin receptor type 2(Rattus norvegicus (Rat))
TBA
US Patent
LigandPNGBDBM143750(US10183953, Example 86 | US8969352, 11 | US8969352...)
Affinity DataKi:  767nM. Assay description: Human Orexin 2 Receptor:HEK293 stably expressing human orexin 2 receptor (Genebank accession number NM_001526) were grown to confluency in DMEM (Hycl...
In DepthDetails US Patent
TargetOrexin receptor type 2(Homo sapiens (Human))
Janssen Pharmaceutica
US Patent
LigandPNGBDBM143750(US10183953, Example 86 | US8969352, 11 | US8969352...)
Affinity DataKi:  767nM. Assay description: HEK293 stably expressing human orexin 2 receptor (Genebank accession number NM 001526) were grown to confluency in DMEM (Hyclone, cat # SH30022), 10%...
In DepthDetails US Patent
TargetOrexin receptor type 2(Homo sapiens (Human))
Janssen Pharmaceutica
US Patent
LigandPNGBDBM143750(US10183953, Example 86 | US8969352, 11 | US8969352...)
Affinity DataKi:  767nM. Assay description: HEK293 stably expressing human orexin 2 receptor (Genebank accession number NM_001526) were grown to confluency in DMEM (Hyclone, cat # SH30022), 10%...
In DepthDetails US Patent
TargetOrexin receptor type 2(Homo sapiens (Human))
Janssen Pharmaceutica
US Patent
LigandPNGBDBM143750(US10183953, Example 86 | US8969352, 11 | US8969352...)
Affinity DataKi:  767nM. Assay description: PFSK-1 cells endogenously expressing the human orexin 2 receptor were grown to confluency in RPMI1640 (Hyclone, cat #30027.02), 10% FBS, 1× pen-strep...
In DepthDetails US Patent
TargetOrexin receptor type 2(Homo sapiens (Human))
Janssen Pharmaceutica
US Patent
LigandPNGBDBM143750(US10183953, Example 86 | US8969352, 11 | US8969352...)
Affinity DataKi:  910nM. Assay description: PFSK-1 cells endogenously expressing the human orexin 2 receptor were grown to confluency in RPMI1640 (Hyclone, cat #30027.02), 10% FBS, 1× pen-strep...
In DepthDetails US Patent
TargetOrexin receptor type 2(Homo sapiens (Human))
Janssen Pharmaceutica
US Patent
LigandPNGBDBM143750(US10183953, Example 86 | US8969352, 11 | US8969352...)
Affinity DataKi:  910nM. Assay description: HEK293 stably expressing human orexin 2 receptor (Genebank accession number NM_001526) were grown to confluency in DMEM (Hyclone, cat # SH30022), 10%...
In DepthDetails US Patent
TargetOrexin receptor type 2(Homo sapiens (Human))
Janssen Pharmaceutica
US Patent
LigandPNGBDBM143750(US10183953, Example 86 | US8969352, 11 | US8969352...)
Affinity DataKi:  946nM. Assay description: HEK293 stably expressing human orexin 2 receptor (Genebank accession number NM_001526) were grown to confluency in DMEM (Hyclone, cat # SH30022), 10%...
In DepthDetails US Patent
TargetOrexin receptor type 2(Homo sapiens (Human))
Janssen Pharmaceutica
US Patent
LigandPNGBDBM143750(US10183953, Example 86 | US8969352, 11 | US8969352...)
Affinity DataKi:  946nM. Assay description: PFSK-1 cells endogenously expressing the human orexin 2 receptor were grown to confluency in RPMI1640 (Hyclone, cat #30027.02), 10% FBS, 1× pen-strep...
In DepthDetails US Patent
TargetOrexin receptor type 2(Homo sapiens (Human))
Janssen Pharmaceutica
US Patent
LigandPNGBDBM143750(US10183953, Example 86 | US8969352, 11 | US8969352...)
Affinity DataKi:  1.48E+3nM. Assay description: PFSK-1 cells endogenously expressing the human orexin 2 receptor were grown to confluency in RPMI1640 (Hyclone, cat #30027.02), 10% FBS, 1× pen-strep...
In DepthDetails US Patent
TargetOrexin receptor type 2(Homo sapiens (Human))
Janssen Pharmaceutica
US Patent
LigandPNGBDBM143750(US10183953, Example 86 | US8969352, 11 | US8969352...)
Affinity DataKi:  1.48E+3nM. Assay description: PFSK-1 cells endogenously expressing the human orexin 2 receptor were grown to confluency in RPMI1640 (Hyclone, cat #30027.02), 10% FBS, 1× pen-strep...
In DepthDetails US Patent
TargetOrexin receptor type 2(Rattus norvegicus (Rat))
TBA
US Patent
LigandPNGBDBM143750(US10183953, Example 86 | US8969352, 11 | US8969352...)
Affinity DataKi:  1.48E+3nM. Assay description: Human Orexin 2 Receptor:HEK293 stably expressing human orexin 2 receptor (Genebank accession number NM_001526) were grown to confluency in DMEM (Hycl...
In DepthDetails US Patent
TargetOrexin receptor type 2(Homo sapiens (Human))
Janssen Pharmaceutica
US Patent
LigandPNGBDBM143750(US10183953, Example 86 | US8969352, 11 | US8969352...)
Affinity DataKi:  1.48E+3nM. Assay description: HEK293 stably expressing human orexin 2 receptor (Genebank accession number NM_001526) were grown to confluency in DMEM (Hyclone, cat # SH30022), 10%...
In DepthDetails US Patent
TargetOrexin receptor type 2(Homo sapiens (Human))
Janssen Pharmaceutica
US Patent
LigandPNGBDBM143750(US10183953, Example 86 | US8969352, 11 | US8969352...)
Affinity DataKi:  1.48E+3nM. Assay description: HEK293 stably expressing human orexin 2 receptor (Genebank accession number NM 001526) were grown to confluency in DMEM (Hyclone, cat # SH30022), 10%...
In DepthDetails US Patent
TargetOrexin receptor type 2(Homo sapiens (Human))
Janssen Pharmaceutica
US Patent
LigandPNGBDBM143750(US10183953, Example 86 | US8969352, 11 | US8969352...)
Affinity DataKi:  1.48E+3nM. Assay description: HEK293 stably expressing human orexin 2 receptor (Genebank accession number NM_001526) were grown to confluency in DMEM (Hyclone, cat # SH30022), 10%...
In DepthDetails US Patent