BDBM144023 US8969325, 224
SMILES CCC1(CC)C[C@@H](NC(=O)Nc2ccc3CCC(=O)Nc3c2)c2ccc(cc2O1)C(F)(F)F
InChI Key InChIKey=YZBONMSABCGXNO-LJQANCHMSA-N
Data  1 IC50
  Tab Delimited (TSV)   2D SDfile   Computed 3D by Vconf -m prep SDfile
Find this compound or compounds like it in BindingDB:
Activity Spreadsheet -- Enzyme Inhibition Constant Data from BindingDB
Found 1 hit for monomerid = 144023
TargetTransient receptor potential cation channel subfamily V member 1(Homo sapiens (Human))
Abbvie
US Patent
LigandPNGBDBM144023(US8969325, 224)
Affinity DataIC50:  35nM. Assay description: The cDNA for human TRPV1 (hTRPV1) was isolated by reverse transcriptase-polymerase chain reaction (RT-PCR) from human small intestine poly A+ RNA sup...
In DepthDetails US Patent