BDBM144637 US8952036, Ex. 5
SMILES COc1cc(NC(=O)C[C@@]2(C)C[C@@H]([C@H](N([C@H](CS(=O)(=O)C(C)(C)C)C3CC3)C2=O)c2ccc(Cl)cc2)c2cccc(Cl)c2)ccc1C(O)=O
InChI Key InChIKey=JVBGVXAXEZXWTE-MCUOQOIASA-N
Data  3 IC50
  Tab Delimited (TSV)   2D SDfile   Computed 3D by Vconf -m prep SDfile
Find this compound or compounds like it in BindingDB:
Activity Spreadsheet -- Enzyme Inhibition Constant Data from BindingDB
Found 3 hits for monomerid = 144637
TargetCytochrome P450 3A4(Homo sapiens (Human))
Amgen
US Patent
LigandPNGBDBM144637(US8952036, Ex. 5)
Affinity DataIC50:  0.0503nMpH: 7.4 T: 2°C. Assay description: The standard assay conditions for the in vitro HTRF assay consisted of a 50 ul total reaction volume in black 384-well Costar polypropylene plates in...
In DepthDetails US Patent
TargetE3 ubiquitin-protein ligase Mdm2(Homo sapiens (Human))
Amgen
Curated by ChEMBL
LigandPNGBDBM144637(US8952036, Ex. 5)
Affinity DataIC50:  0.5nM. Assay description: Binding affinity to human GST-thrombin-tagged MDM2 ( 1 to 188 aa) assessed as inhibition of interaction with human p53 preincubated with compound for...
In DepthDetails ArticlePubMed
TargetE3 ubiquitin-protein ligase Mdm2(Homo sapiens (Human))
Amgen
Curated by ChEMBL
LigandPNGBDBM144637(US8952036, Ex. 5)
Affinity DataIC50:  0.130nM. Assay description: Binding affinity to human GST-thrombin-tagged MDM2 ( 1 to 188 aa) assessed as inhibition of interaction with human p53 preincubated with compound for...
In DepthDetails ArticlePubMed