BDBM144784 US8952128, 42
SMILES C[C@@H](O)[C@@H]1NC(=O)[C@H](CCCCN)NC(=O)[C@@H](Cc2c[nH]c3ccccc23)NC(=O)[C@H](Cc2ccccc2)NC(=O)[C@H](Cc2ccccc2)NC(=O)[C@H](CCCNC(N)=N)NC(=O)[C@@H](CCCCNC(=O)[C@H](Cc2ccc(F)cc2)NC1=O)NC[C@H](Cc1ccc(O)cc1)NC(=O)CCN(C[C@@H]1C[C@H]2[C@@H](Cc3c[nH]c4cccc2c34)N(C)C1)S(C)(=O)=O
InChI Key
Data  2 KI
  Tab Delimited (TSV)   2D SDfile   Computed 3D by Vconf -m prep SDfile
Find this compound or compounds like it in BindingDB:
Activity Spreadsheet -- Enzyme Inhibition Constant Data from BindingDB
Found 2 hits for monomerid = 144784
TargetSomatostatin receptor type 2(Homo sapiens (Human))
Ipsen Pharma
US Patent
LigandPNGBDBM144784(US8952128, 42)
Affinity DataKi:  0.690nM ΔG°:  -12.5kcal/molepH: 7.6 T: 2°C. Assay description: Membranes for in vitro receptor binding assays were obtained by the following procedures. CHO-K1 cells expressing one of the somatostatin receptors w...
In DepthDetails US Patent
TargetD(2) dopamine receptor(Homo sapiens (Human))
Ipsen Pharma
US Patent
LigandPNGBDBM144784(US8952128, 42)
Affinity DataKi:  285nMpH: 7.6Assay Description:The affinity of a test compound for the human dopamine receptor subtype hDRD2 was determined by radioligand binding assays in CHO-K1 cells stably tra...
In DepthDetails US Patent